program: Gaussian 09
title: 000035668
version: EM64L-G09RevD.01
frameworkgroup: C1[X(C15H8Cl3N3)]
method: RPBEPBE
basis: SDD
operation: Freq
keyword: #p
keyword: freq=noraman
keyword: PBEPBE/SDD
title: #p freq=noraman PBEPBE/SDD
converged: NO YES NO NO
title: Mulliken charges:
elementType: Cl Cl Cl N N N C C C C C C C C C C C C C C C H H H H H H H H
charge: -0.035589 -0.035590 0.012142 -0.064640 0.040025 0.040061 0.312989 0.312997 -0.009938 -0.009923 -0.339608 -0.321734 -0.339607 -0.321727 -0.207106 -0.213198 -0.207106 -0.213196 -0.103757 -0.103746 -0.362090 0.273016 0.288329 0.273013 0.288328 0.261099 0.262724 0.261105 0.262730
chargesum: 0.00000
title: Mulliken charges with hydrogens summed into heavy atoms:
elementType: Cl Cl Cl N N N C C C C C C C C C C C C C C C
charge: -0.035589 -0.035590 0.012142 -0.064640 0.040025 0.040061 0.312989 0.312997 -0.009938 -0.009923 -0.066592 -0.033405 -0.066594 -0.033399 0.053994 0.049525 0.053998 0.049534 -0.103757 -0.103746 -0.362090
polarizability: 4.11738145e+02 -8.66584450e-03 2.65509152e+02 -5.13047274e-02 -2.21764457e-01 7.55064411e+01
1716.lowfreq: -5.0379 -4.9481 -0.0020 -0.0011 0.0003 2.7668 31.9816 35.1900 44.4078
frequency: 31.9449 35.1884 44.4077 50.0417 62.4491 101.9637 133.8272 152.7339 160.6964 191.7072 194.8333 244.8411 282.6768 285.6685 311.6538 329.9219 349.9113 409.5286 410.7168 433.8524 472.6759 473.2623 480.3104 489.3309 565.2452 623.4486 624.1759 645.5673 667.5308 672.0381 701.0775 723.8067 748.4629 804.8385 809.5859 815.0281 839.4679 841.6301 856.0752 865.6092 906.2192 982.8226 986.6262 994.2445 994.6805 997.9783 999.0812 1059.5210 1069.7161 1072.5123 1097.6535 1105.3871 1114.4691 1172.9535 1179.5408 1183.3195 1197.7797 1288.8110 1291.1041 1338.7207 1358.0183 1376.7842 1394.0165 1401.6484 1403.3642 1420.9971 1456.9307 1483.3410 1494.5967 1576.5838 1578.2808 1599.0441 1601.4749 3162.9550 3163.4044 3163.4953 3163.5072 3179.3508 3179.5854 3183.1484 3183.4569
redmass: 6.0419 3.8674 13.6245 6.9276 9.7745 14.4869 10.7574 11.0586 12.6460 12.4260 12.0023 10.7183 7.7408 8.0797 7.4369 8.3372 6.8926 2.9208 2.9366 9.1490 3.4147 9.5405 9.1152 3.2720 8.3867 7.2234 7.1840 7.7224 4.8379 8.6062 7.9423 4.2901 3.6348 10.0602 7.6139 2.9942 1.2578 1.2496 1.6263 2.1895 13.6763 1.3680 1.3666 1.3578 1.3595 4.1138 4.3368 6.6598 3.0060 2.3375 2.0486 1.3672 2.1323 1.3333 1.1836 4.0158 5.6090 1.2564 1.2792 5.0106 5.0189 5.1084 8.6328 4.6604 3.4100 5.2284 7.7950 3.1420 3.7836 8.0006 8.0185 6.2868 6.3865 1.0887 1.0887 1.0889 1.0889 1.0967 1.0966 1.0980 1.0979
irintensity: 0.0519 0.0000 0.0041 0.2903 0.0000 0.1804 0.8228 0.0000 0.1468 0.4314 0.4222 3.7472 0.0012 0.6767 0.3438 5.1736 6.3690 0.0000 0.0014 17.1568 0.8598 60.6780 5.0307 41.8698 3.6304 1.4648 0.5832 5.6610 0.0001 1.2219 1.3038 1.3928 0.0000 132.3847 47.8499 96.6321 0.0008 0.0646 0.0029 55.7170 3.3216 0.0015 1.7554 0.0033 1.2829 115.6435 13.5323 66.2051 131.8787 8.7111 0.5799 3.4017 0.5024 99.7711 30.9520 4.8399 206.4394 0.2681 4.3177 244.2513 196.8899 126.9662 2.8288 0.9637 25.4076 525.5904 1559.1431 84.4446 1.6183 13.5249 12.0341 218.4621 70.1972 0.2408 0.0860 0.3860 0.4198 1.3315 2.2829 7.0498 3.6727
temp: 298.150 k
press: 1.00000 atm
elementType: 17 17 17 7 7 7 6 6 6 6 6 6 6 6 6 6 6 6 6 6 6 1 1 1 1 1 1 1 1
symmnumber: 1
zpe: 505391.5 jmol-1
zpe.correction: 0.192493 hartree
zpe.thermalcorrener: 0.210007 hartree
zpe.thermalcorrenthalpy: 0.210951 hartree
zpe.thermalcorrgfe: 0.143949 hartree
zpe.sumelectzpe: -2119.408626 hartree
zpe.sumelectthermal: -2119.391112 hartree
zpe.sumelectthermalent: -2119.390168 hartree
zpe.sumelectthermalfe: -2119.457170 hartree
dipole: 0.0007 -1.7477 0.0051
dipole: 1.7477
quadrupole: -145.7564 -142.5184 -144.4210
quadrupole: -0.0010 -0.0166 -0.0756
quadrupole: -1.5245 1.7136 -0.1891 -0.0010 -0.0166 -0.0756
hfenergy: -2119.601119 hartree
pointgroup: C01 [X(C15H8Cl3N3)]
dipole: 0.0005873 0.6794797 -0.1052753 debye
polarizability: 411.7381326|-0.0544388|261.1548652|0.009239|-28.4327183|79.8607404 unknown
InChI: InChI=1S/C15H8Cl3N3/c16-11-5-1-9(2-6-11)13-19-14(21-15(18)20-13)10-3-7-12(17)8-4-10/h1-8H
charge 0 multiplicity 1
29 atoms
Cl -6.48193 2.246859 -0.289173
Cl 6.484672 2.240931 -0.290546
Cl -0.001584 -4.460854 0.725492
N  0.000356 -0.00822 0.037168
N  1.20857 -2.08425 0.358062
N  -1.209641 -2.083102 0.358418
C  -2.452369 0.00233 0.039748
C  2.453076 0.000052 0.039182
C  -1.167399 -0.716265 0.146225
C  1.167546 -0.71729 0.14614
C  -2.473959 1.407043 -0.175864
C  -3.678028 -0.70859 0.153441
C  2.475974 1.404173 -0.180304
C  3.678141 -0.711387 0.156285
C  -3.6979 2.095441 -0.277038
C  -4.908284 -0.030967 0.053899
C  3.700512 2.09143 -0.281877
C  4.908988 -0.034888 0.056583
C  -4.89838 1.363463 -0.16011
C  4.900326 1.358955 -0.161265
C  -0.000801 -2.668528 0.448361
H  -1.524713 1.942736 -0.261876
H  -3.647266 -1.789055 0.319618
H  1.527204 1.94029 -0.268935
H  3.646421 -1.791419 0.325109
H  -3.723128 3.175953 -0.442442
H  -5.854903 -0.571368 0.140135
H  3.726688 3.171428 -0.450449
H  5.85511 -0.575698 0.145614
