program: Gaussian 09
title: 000035656
version: EM64L-G09RevD.01
frameworkgroup: C1[X(C11H18ClN3OS)]
method: RPBEPBE
basis: SDD
operation: Freq
keyword: #p
keyword: freq=noraman
keyword: PBEPBE/SDD
title: #p freq=noraman PBEPBE/SDD
converged: YES YES NO NO
title: Mulliken charges:
elementType: Cl S O N N N C C C C C C C C C C C H H H H H H H H H H H H H H H H H H
charge: 0.022232 0.295788 -0.191739 -0.031980 0.088260 0.064734 -0.366560 -0.370703 -0.330867 -0.344663 -0.638070 -0.274315 -0.681429 -0.684853 -0.282924 0.097682 -0.322606 0.210375 0.216319 0.216120 0.215331 0.217856 0.194362 0.195851 0.195057 0.270849 0.283154 0.223379 0.223659 0.222483 0.206323 0.212732 0.214482 0.214320 0.219359
chargesum: 0.00000
title: Mulliken charges with hydrogens summed into heavy atoms:
elementType: Cl S O N N N C C C C C C C C C C C
charge: 0.022232 0.295788 -0.191739 -0.031980 0.088260 0.064734 0.060134 0.060749 0.081351 0.046245 -0.084067 0.172724 -0.039891 -0.036693 -0.282924 0.097682 -0.322606
polarizability: 2.14955185e+02 1.15794263e+01 2.30040400e+02 4.60210835e+00 6.19626847e+00 1.04759236e+02
1716.lowfreq: -4.3518 -2.1731 0.0015 0.0025 0.0031 5.1515 25.6923 28.0291 34.0366
frequency: 25.0839 27.9927 34.0308 48.3025 55.0467 70.1245 95.9823 103.6175 113.8914 120.6194 151.4428 172.8777 180.5462 182.4020 212.6840 225.3882 235.3823 242.5140 251.7867 275.7745 342.2353 395.0455 420.7736 433.8975 487.5117 549.5319 615.1628 615.9281 626.9974 671.6339 741.6497 742.3605 786.2825 792.8500 799.5072 806.5674 862.8090 874.5224 884.3478 908.8831 922.8210 931.0510 984.1146 1016.0339 1039.4776 1068.1752 1069.7086 1081.2779 1110.5713 1123.1425 1144.0109 1182.9038 1189.0979 1199.1704 1210.7412 1227.1546 1234.3529 1270.4700 1273.6583 1279.1853 1287.3730 1294.6962 1307.8038 1326.8058 1353.6203 1359.4421 1389.6312 1394.7759 1395.1222 1421.0498 1439.1084 1445.3386 1457.8549 1468.0261 1472.2437 1473.3098 1478.3046 1480.4279 1480.6612 1485.8221 1490.6996 2968.0710 2969.4905 2975.4182 2978.1775 2979.7849 2996.5722 3004.3134 3012.9396 3013.1869 3034.4669 3043.0488 3050.6288 3071.9166 3073.4437 3078.0214 3078.8932 3083.5309 3113.7018
redmass: 4.9159 4.1751 3.7829 1.9691 2.5280 2.3653 2.9376 3.0690 3.6572 2.3124 12.5840 8.9680 6.7836 3.9268 5.6508 1.5796 1.1801 1.5920 3.6145 3.3597 4.6419 6.0887 5.3696 6.9060 3.8182 7.6818 8.8025 7.6227 5.0451 12.0309 1.0713 1.1758 12.6111 12.4694 1.1401 1.6830 4.7616 1.5400 12.6483 1.9141 1.3464 1.1664 11.4124 2.6509 3.3991 1.7409 1.4027 2.2055 2.0875 2.6462 1.4386 8.8738 1.4919 10.4325 1.3621 1.4368 5.8879 1.2654 1.2102 1.2448 1.0734 1.1929 1.2479 1.7525 1.8009 1.5786 1.9406 1.5605 1.3159 8.0961 1.1675 3.5484 1.0753 1.1556 1.0908 1.0592 1.0445 1.0899 1.0421 1.0775 1.0996 1.0590 1.0596 1.0369 1.0362 1.0614 1.0598 1.0565 1.1008 1.0961 1.0757 1.0848 1.1039 1.1010 1.1028 1.0992 1.0995 1.1064 1.1082
irintensity: 0.0958 0.1036 0.0219 0.0148 0.4830 0.0566 0.4320 0.4666 0.2730 1.7272 0.3495 0.0168 0.1328 2.1876 2.5358 0.9385 0.3435 1.8314 5.2222 2.2654 0.3561 5.5472 3.0626 5.7949 4.2169 1.8405 0.5966 1.0440 3.0956 2.2851 8.5306 11.0719 8.5495 142.2949 0.3965 1.6668 47.9412 3.2310 0.5810 3.2492 11.0237 1.1988 241.3161 4.1434 53.1275 5.3375 3.1116 7.5687 2.5604 7.6490 1.8975 86.5305 11.9490 229.6659 0.0641 22.4422 165.6314 7.6059 4.5945 5.9832 0.1768 3.8670 3.6063 219.5133 81.6760 2.6321 36.8361 27.4155 47.2220 694.3355 110.7125 703.6807 3.4695 51.9572 26.4958 3.4807 13.2055 5.1464 15.1070 16.3759 18.2852 28.0058 6.0346 46.6834 33.8621 53.0623 4.6588 42.5747 10.5305 3.4381 6.1940 22.5440 0.7356 71.9385 12.3145 41.8496 45.1882 101.7669 15.2376
temp: 298.150 k
press: 1.00000 atm
elementType: 17 16 8 7 7 7 6 6 6 6 6 6 6 6 6 6 6 1 1 1 1 1 1 1 1 1 1 1 1 1 1 1 1 1 1
symmnumber: 1
zpe: 735516.9 jmol-1
zpe.correction: 0.280144 hartree
zpe.thermalcorrener: 0.300008 hartree
zpe.thermalcorrenthalpy: 0.300952 hartree
zpe.thermalcorrgfe: 0.228124 hartree
zpe.sumelectzpe: -1526.227781 hartree
zpe.sumelectthermal: -1526.207917 hartree
zpe.sumelectthermalent: -1526.206973 hartree
zpe.sumelectthermalfe: -1526.279801 hartree
dipole: -0.2212 -7.0489 -0.3595
dipole: 7.0615
quadrupole: -115.3906 -124.6751 -115.4147
quadrupole: -2.5853 -0.7918 -0.0258
quadrupole: 3.1029 -6.1816 3.0788 -2.5853 -0.7918 -0.0258
hfenergy: -1526.5079247 hartree
pointgroup: C01 [X(C11H18Cl1N3O1S1)]
dipole: 0.1874444 -2.766866 0.1664961 debye
polarizability: 215.7603021|-12.015781|229.0598248|5.5824166|-7.1708191|104.9346948 unknown
InChI: InChI=1S/C11H18ClN3OS/c1-3-5-7-16-10-13-9(12)14-11(15-10)17-8-6-4-2/h3-8H2,1-2H3
charge 0 multiplicity 1
35 atoms
Cl -0.4597 4.963036 -0.23804
S  2.676203 0.661119 0.363964
O  -2.407187 0.373678 -0.080804
N  -0.05908 0.489758 0.134425
N  0.954549 2.695333 0.060091
N  -1.451242 2.466202 -0.14606
C  3.626092 -1.978737 0.626599
C  -3.703732 -1.671693 -0.083584
C  4.532106 -1.919446 -0.625641
C  -3.719935 -3.21517 0.02781
C  2.304576 -1.204254 0.494419
C  -2.286804 -1.114859 0.039232
C  5.797495 -2.790161 -0.475114
C  -5.145305 -3.793208 -0.105259
C  1.019683 1.328351 0.169246
C  -1.265019 1.112608 -0.026339
C  -0.301988 3.169327 -0.091572
H  3.363231 -3.03748 0.830197
H  4.187159 -1.624621 1.514487
H  -4.33907 -1.230278 0.707508
H  -4.134663 -1.360142 -1.053884
H  4.824307 -0.870162 -0.825547
H  3.950922 -2.254184 -1.508741
H  -3.285639 -3.52206 1.000986
H  -3.070249 -3.6514 -0.758198
H  1.743692 -1.486874 -0.411154
H  1.652529 -1.334707 1.372657
H  -1.619086 -1.478123 -0.763522
H  -1.823068 -1.349802 1.014995
H  6.429659 -2.738344 -1.379839
H  5.533779 -3.851641 -0.307368
H  6.41057 -2.456456 0.383221
H  -5.808922 -3.397947 0.686148
H  -5.590959 -3.526112 -1.081451
H  -5.141204 -4.895252 -0.024767
