program: Gaussian 09
title: 000035626
version: EM64L-G09RevD.01
frameworkgroup: C1[X(C10H7Cl2N3O)]
method: RPBEPBE
basis: SDD
operation: Freq
keyword: #p
keyword: freq=noraman
keyword: PBEPBE/SDD
title: #p freq=noraman PBEPBE/SDD
converged: NO YES NO NO
title: Mulliken charges:
elementType: Cl Cl O N N N C C C C C C C C C C H H H H H H H
charge: 0.044720 0.052571 -0.182633 0.079661 0.004611 0.119483 0.482197 -0.452326 -0.379026 -0.378859 -0.222946 -0.222928 -0.225773 0.131885 -0.240339 -0.271158 0.245133 0.245725 0.234850 0.234723 0.232809 0.232820 0.234802
chargesum: 0.00000
title: Mulliken charges with hydrogens summed into heavy atoms:
elementType: Cl Cl O N N N C C C C C C C C C C
charge: 0.044720 0.052571 -0.182633 0.079661 0.004611 0.119483 0.482197 0.038532 -0.144176 -0.144136 0.009863 0.009891 0.009028 0.131885 -0.240339 -0.271158
polarizability: 2.23779029e+02 9.01807550e+00 1.39681633e+02 1.91904428e-01 2.46510529e-02 1.02663419e+02
1716.lowfreq: -8.2005 0.0002 0.0013 0.0018 2.0730 4.0625 11.3743 12.5775 47.9669
frequency: 10.4123 11.8948 47.9508 85.6351 120.5231 143.0878 165.3577 185.6060 213.0387 239.6860 306.3542 324.5567 383.8036 400.5862 428.7136 462.8128 536.0995 554.6395 616.8466 622.8942 639.2815 672.1715 701.2619 751.2198 785.4620 787.5775 819.4950 847.4721 852.3012 877.8375 932.0738 941.6136 954.1249 977.8205 991.4314 1001.3737 1026.4313 1090.0368 1161.7873 1175.3781 1188.2923 1192.7037 1194.0197 1232.2479 1251.3177 1316.9617 1326.3497 1388.4634 1398.6439 1406.2908 1442.4766 1457.9367 1471.3464 1488.3403 1597.5853 1618.4290 3030.9600 3102.1414 3126.7585 3127.8928 3140.4744 3154.1730 3169.6969
redmass: 5.2422 4.1938 7.6428 5.7819 8.2128 15.2798 14.0290 11.2117 9.5469 8.4677 7.2470 2.1854 22.1100 2.7792 16.7646 4.8051 6.8975 5.6507 6.3321 12.3688 7.6378 12.2564 1.7653 2.4693 5.5385 12.6940 5.9678 4.2632 1.2492 13.5094 1.5238 1.6349 13.2714 1.3960 6.1490 1.3325 2.1758 1.5182 12.4327 1.0546 1.2066 1.0828 6.2145 2.4111 12.1606 1.7582 1.2742 8.7861 12.3603 4.4595 2.1960 1.3033 3.9722 2.5052 6.1318 6.2045 1.0578 1.1087 1.0861 1.0888 1.0917 1.0962 1.1017
irintensity: 0.0572 0.0181 0.0839 1.3240 1.8041 0.2002 0.1383 0.7616 1.6224 4.8504 2.9942 0.9213 4.3951 0.0022 9.0281 1.3409 32.9754 18.4054 0.0898 0.0015 6.0994 1.5311 52.6250 34.4199 155.2642 8.9466 57.2123 31.8940 0.0055 7.5778 0.3892 2.5470 388.6387 0.0124 1.2323 0.0120 2.6768 7.3097 153.4043 0.0040 33.9938 2.4207 201.3880 14.8115 115.6222 422.8444 0.3067 1.1226 589.4361 17.8734 10.0277 206.1499 791.5495 38.9930 0.7418 1.1348 11.6181 6.8872 5.5797 3.1563 11.7530 33.5494 19.9736
temp: 298.150 k
press: 1.00000 atm
elementType: 17 17 8 7 7 7 6 6 6 6 6 6 6 6 6 6 1 1 1 1 1 1 1
symmnumber: 1
zpe: 404757.4 jmol-1
zpe.correction: 0.154164 hartree
zpe.thermalcorrener: 0.168086 hartree
zpe.thermalcorrenthalpy: 0.169030 hartree
zpe.thermalcorrgfe: 0.108596 hartree
zpe.sumelectzpe: -1543.703155 hartree
zpe.sumelectthermal: -1543.689234 hartree
zpe.sumelectthermalent: -1543.688289 hartree
zpe.sumelectthermalfe: -1543.748724 hartree
dipole: -4.4315 1.5024 -0.0041
dipole: 4.6792
quadrupole: -101.1421 -114.0500 -96.9942
quadrupole: 0.8367 -0.0337 -0.0283
quadrupole: 2.9200 -9.9879 7.0679 0.8367 -0.0337 -0.0283
hfenergy: -1543.8573191 hartree
pointgroup: C01 [X(C10H7Cl2N3O1)]
dipole: -1.7426263 0.5935337 -0.0080681 debye
dipolederiv: -0.2764676 -0.3007949 0.0038892 -0.3934886 -0.7948573 0.0098677 0.0061896 0.0123413 -0.0521616 -0.4397323 0.4016314 -0.0058344 0.4722587 -0.638469 0.0084997 -0.0057353 0.0069025 -0.0453501 -2.5037728 0.1224427 -0.0037708 0.2666122 -0.3179886 -0.0000929 -0.0090364 0.0014956 -0.2616372 -1.7722504 0.3730001 -0.0080728 0.4999776 -0.6556285 0.0083655 -0.0149249 0.0082776 -0.1350083 -1.5599444 -0.3556328 0.0019405 -0.6515081 -0.7988163 0.0077076 0.0012707 0.0081963 -0.1138944 -0.7117852 0.1375105 -0.0052234 0.0783689 -1.6948882 0.0218415 -0.0015524 0.0215869 -0.08465 -0.1302243 0.000968 0.0010708 -0.152943 -0.10641 0.0034043 0.0039692 0.0026097 -0.009227 1.6095884 -0.0499625 -0.0026378 -0.6607004 0.3766453 -0.0028869 0.0037604 -0.0042423 0.2805544 -0.0270416 0.0346555 -0.1024809 0.0350361 -0.1200176 -0.0138303 0.0443099 -0.005217 0.0444205 -0.0264832 0.0383765 0.101858 0.0322475 -0.119323 0.0193037 -0.0438443 0.0103575 0.0411338 -0.0876582 0.0296509 0.1172446 0.0334835 -0.1309127 0.0431764 0.1347452 0.0325135 0.0656926 -0.0912574 0.0248096 -0.1154699 0.0282796 -0.1333258 -0.0366034 -0.1325237 -0.0256702 0.0725062 0.0830974 0.0867758 -0.0027333 0.0779426 -0.1163696 0.0008455 -0.0027645 0.0008807 -0.0267857 2.7829041 -0.1066518 0.007534 0.3460711 0.8196928 -0.0074327 0.0097334 -0.0079168 0.2575523 1.481762 0.2751342 0.0002193 0.5389982 1.9297787 -0.0259932 -0.0029969 -0.0268371 0.0773431 1.6885874 -0.4495033 0.0101943 -0.5371293 1.7703202 -0.0221394 0.0108779 -0.0218818 0.0672275 -0.048355 -0.0120906 0.0241011 0.1265352 0.024695 0.0295212 0.0595841 0.0858684 -0.0365397 -0.0475627 -0.0146721 -0.0241801 0.1232551 0.0205769 -0.0312965 -0.0637256 -0.0869624 -0.0295275 0.0610929 -0.0399437 0.0976264 -0.0403145 0.1312783 0.0282094 0.0933232 0.0198399 -0.041246 0.0576882 -0.0438628 -0.0975829 -0.0445071 0.1290809 -0.0336186 -0.0938267 -0.0252143 -0.0361443 0.0289661 -0.0376 -0.0798858 -0.0477854 0.1450141 -0.0276382 -0.0996401 -0.0298408 -0.0595225 0.032274 -0.0342684 0.0791217 -0.0435121 0.1468263 0.020783 0.0995446 0.0229728 -0.0644126 -0.1034252 -0.0799723 0.0030723 -0.0871777 0.1330982 0.0000068 0.0032625 -0.0000603 0.0896766 unknown
polarizability: 223.8051521|8.8967593|139.6490751|-0.0559285|-0.4980677|102.6698539 unknown
InChI: InChI=1S/C10H7Cl2N3O/c11-8-13-9(12)15-10(14-8)16-6-7-4-2-1-3-5-7/h1-5H,6H2
charge 0 multiplicity 1
23 atoms
Cl 3.853161 2.766937 -0.039676
Cl 4.39619 -2.577699 0.033831
O  -0.088867 -0.388523 -0.012786
N  2.007677 -1.349358 0.011256
N  1.764763 1.07313 -0.022155
N  3.969875 0.077704 0.00164
C  -2.394395 0.3938 -0.011695
C  -0.965211 0.859469 -0.032776
C  -3.087628 0.150754 -1.224053
C  -3.065111 0.194926 1.221258
C  -4.429025 -0.289068 -1.205096
C  -4.406374 -0.24503 1.243241
C  -5.090362 -0.487805 0.029247
C  1.251278 -0.20263 -0.007782
C  3.112935 1.125093 -0.014369
C  3.332424 -1.128391 0.015596
H  -0.703677 1.421536 -0.945117
H  -0.690036 1.461418 0.84951
H  -2.574912 0.301517 -2.181565
H  -2.534776 0.380331 2.162988
H  -4.957236 -0.475165 -2.146271
H  -4.916926 -0.396782 2.200184
H  -6.131765 -0.827564 0.044892
