program: Gaussian 09
title: 000035637
version: EM64L-G09RevD.01
frameworkgroup: C1[X(C7H9Cl2N3S)]
method: RPBEPBE
basis: SDD
operation: Freq
keyword: #p
keyword: freq=noraman
keyword: PBEPBE/SDD
title: #p freq=noraman PBEPBE/SDD
converged: YES YES NO NO
title: Mulliken charges:
elementType: Cl Cl S N N N C C C C C C C H H H H H H H H H
charge: 0.042203 0.049805 0.316142 0.102218 0.098026 0.126034 -0.366542 -0.332906 -0.643503 -0.680093 -0.266623 -0.252104 -0.263534 0.216332 0.217965 0.198804 0.213811 0.282668 0.296870 0.223240 0.208595 0.212593
chargesum: 0.00000
title: Mulliken charges with hydrogens summed into heavy atoms:
elementType: Cl Cl S N N N C C C C C C C
charge: 0.042203 0.049805 0.316142 0.102218 0.098026 0.126034 0.067756 0.079709 -0.063966 -0.035664 -0.266623 -0.252104 -0.263534
polarizability: 2.09081086e+02 5.31515413e+00 1.49794502e+02 -6.39461099e+00 4.81922174e-01 7.00770380e+01
1716.lowfreq: -6.6373 -3.1229 -0.0018 -0.0006 0.0025 2.0975 14.0903 43.0433 53.5031
frequency: 14.0699 43.0018 53.4383 86.0205 111.3288 132.6163 151.7192 164.0227 183.5230 218.9359 220.9943 241.0093 267.2040 369.7069 426.3246 429.0021 462.8969 497.4178 613.1833 616.1272 621.8782 739.1234 782.6913 783.4960 783.9701 804.1142 870.0567 880.8840 920.0040 1015.4979 1064.5561 1070.4918 1110.6594 1149.4652 1183.3170 1190.8708 1222.1900 1228.9252 1240.0299 1281.8861 1295.5266 1308.9703 1359.1234 1382.7477 1392.3265 1434.0958 1443.7889 1457.3197 1472.7381 1478.4368 1484.7746 2971.0344 2976.5990 2979.8631 3012.8042 3036.7873 3047.0896 3072.8047 3079.7707 3122.2900
redmass: 4.8861 4.0282 2.1679 3.1107 4.0183 15.4192 14.2841 12.8650 8.0318 4.1824 1.6508 1.7917 2.9232 17.9652 15.6573 7.6542 5.9396 5.8152 4.0782 10.9299 12.2689 1.1782 11.2005 13.7518 12.5807 1.7249 1.4000 12.6343 1.3579 2.6559 1.8514 1.3632 2.1320 10.4971 7.9702 1.5462 6.6945 1.5283 6.0549 1.2165 1.2417 1.2350 1.5796 11.4332 1.2137 1.2579 4.8573 1.0777 1.0588 1.0431 1.0766 1.0591 1.0378 1.0598 1.0979 1.0894 1.0712 1.1009 1.0992 1.1084
irintensity: 0.0880 0.4046 0.1474 0.7845 0.4528 0.0481 0.0037 0.0185 0.7475 1.5373 0.3617 0.8530 0.2123 3.6530 7.1916 0.7720 0.6881 5.2423 3.8422 0.5059 0.0237 10.7699 138.7972 179.3230 3.1667 0.3485 8.0545 6.4860 10.8760 6.1868 5.8201 3.2405 3.6138 94.4209 263.0346 7.6990 114.9311 10.6100 20.5126 2.7358 8.2920 6.3646 4.3173 571.1095 13.3381 254.7086 760.0533 2.5677 3.3622 14.1385 16.8201 3.1674 32.1927 67.9104 2.5784 10.5257 16.2114 71.5471 42.0411 10.1662
temp: 298.150 k
press: 1.00000 atm
elementType: 17 17 16 7 7 7 6 6 6 6 6 6 6 1 1 1 1 1 1 1 1 1
symmnumber: 1
zpe: 407062.5 jmol-1
zpe.correction: 0.155042 hartree
zpe.thermalcorrener: 0.169223 hartree
zpe.thermalcorrenthalpy: 0.170167 hartree
zpe.thermalcorrgfe: 0.110577 hartree
zpe.sumelectzpe: -1753.574698 hartree
zpe.sumelectthermal: -1753.560516 hartree
zpe.sumelectthermalent: -1753.559572 hartree
zpe.sumelectthermalfe: -1753.619162 hartree
dipole: 4.3072 1.1012 -0.2263
dipole: 4.4514
quadrupole: -96.5129 -104.0085 -96.5944
quadrupole: 2.8594 0.1174 -0.6534
quadrupole: 2.5256 -4.9699 2.4442 2.8594 0.1174 -0.6534
hfenergy: -1753.7297394 hartree
pointgroup: C01[X(C7H9Cl2N3S1)]
dipole: 1.6861142 0.4710482 0.0478579 debye
dipolederiv: -0.1886914 0.1936068 0.068673 0.3099473 -0.7918126 -0.2495697 0.1069633 -0.2451259 -0.1358746 -0.5977892 -0.4251065 -0.092519 -0.4871383 -0.4896209 -0.1026499 -0.1074585 -0.1042434 -0.0704914 -0.8891832 -0.037913 0.0686313 0.1022284 -0.0008615 0.0084277 0.1513012 0.0209269 -0.0366919 -1.9850494 -0.3439557 0.0254118 -0.3452921 -0.5610667 -0.1217342 0.0444158 -0.1161793 -0.1401521 -1.4233977 0.4452964 0.2301036 0.7350949 -0.8941239 -0.303915 0.3425595 -0.2913376 -0.1811881 -0.7889763 -0.2860748 -0.0389723 -0.1837077 -1.445391 -0.4051663 -0.0003382 -0.3952016 -0.2177296 -0.0115585 0.0195556 -0.0011795 -0.1480592 0.0574208 0.0357366 -0.0615824 0.0154541 0.1117056 0.020929 0.0051878 0.0134852 0.0773361 0.089823 0.0397904 0.0644932 0.0537056 0.1188702 0.4029035 0.2241914 0.0269584 0.4232675 0.1912694 0.0242019 0.0464146 0.0301294 0.1081088 -0.0570375 0.0293469 0.0006932 0.0276212 0.0892346 0.019266 -0.0377032 0.0172379 0.0728853 2.2196303 -0.0335622 -0.156695 -0.3547094 0.6408204 0.2186642 -0.3009837 0.1886147 0.1098826 1.3829501 -0.2043249 -0.1556702 -0.4114869 1.8178852 0.5583105 -0.2292686 0.5508929 0.2806008 1.9160467 0.5470616 0.0345479 0.512422 1.4883176 0.3998894 0.0100825 0.3928305 0.2076111 0.072883 0.0134215 0.0204347 0.0820109 0.0646967 -0.0695451 0.0313561 -0.0154114 -0.1391903 -0.0760207 -0.102417 -0.0071339 -0.0627984 -0.1013505 0.0063576 -0.0228747 -0.0251246 0.0914556 0.0274449 0.0364579 0.0612699 0.0281712 0.0451133 -0.0754605 0.0403973 -0.0364315 -0.1606907 0.0032159 -0.0993289 -0.0152888 -0.1478431 -0.1009172 0.0059135 -0.0281343 -0.0280047 0.0663017 0.0035012 -0.0284606 0.0228001 -0.1146258 0.014373 -0.0411962 0.0497637 -0.0473983 -0.062268 -0.0597764 0.0315123 -0.0567293 -0.0286416 -0.0442631 0.0463524 -0.0931887 0.0359999 0.035639 -0.0340802 0.074733 -0.0649978 0.1243326 -0.0132197 0.1076501 -0.1039308 0.1101499 -0.0017915 0.0022449 -0.0611556 -0.0001363 -0.1470361 -0.1289724 -0.0318888 0.0081311 -0.0322736 0.0903471 0.0598108 0.0019281 0.0163127 0.0089065 0.0726453 -0.0694345 0.089585 -0.0792098 -0.1473393 unknown
polarizability: 208.8999422|7.8154753|143.8913731|-3.8612672|21.2884049|76.16131 unknown
InChI: InChI=1S/C7H9Cl2N3S/c1-2-3-4-13-7-11-5(8)10-6(9)12-7/h2-4H2,1H3
charge 0 multiplicity 1
22 atoms
Cl -2.607246 2.756702 0.94043
Cl -3.986994 -2.232346 -0.496671
S  1.194959 -0.848412 -0.484102
N  -1.441004 -1.370742 -0.435659
N  -0.81631 0.886181 0.212807
N  -3.146777 0.226488 0.201333
C  3.589331 0.627115 -0.339928
C  4.298079 -0.373078 0.603761
C  2.08442 0.794481 -0.081018
C  5.815905 -0.455294 0.336829
C  -0.507226 -0.3867 -0.206498
C  -2.1348 1.108665 0.390277
C  -2.713319 -0.996277 -0.214073
H  3.763517 0.338155 -1.39565
H  4.05007 1.628494 -0.214555
H  4.118874 -0.068818 1.654659
H  3.847666 -1.378944 0.489935
H  1.860216 1.030859 0.971459
H  1.626154 1.561875 -0.723886
H  6.304516 -1.170709 1.02235
H  6.300063 0.529763 0.475798
H  6.020007 -0.787558 -0.698297
