program: Gaussian 09
title: 000035624
version: EM64L-G09RevD.01
frameworkgroup: C1[X(C9H5F2N3O)]
method: RPBEPBE
basis: SDD
operation: Freq
keyword: #p
keyword: freq=noraman
keyword: PBEPBE/SDD
title: #p freq=noraman PBEPBE/SDD
converged: NO YES NO NO
title: Mulliken charges:
elementType: F F O N N N C C C C C C C C C H H H H H
charge: -0.122935 -0.121361 -0.238067 0.001854 -0.043395 -0.023153 0.423813 -0.350640 -0.350624 -0.191083 -0.191091 -0.233699 0.055751 0.096229 0.068852 0.253993 0.253986 0.237207 0.237207 0.237157
chargesum: 0.00000
title: Mulliken charges with hydrogens summed into heavy atoms:
elementType: F F O N N N C C C C C C C C C
charge: -0.122935 -0.121361 -0.238067 0.001854 -0.043395 -0.023153 0.423813 -0.096647 -0.096638 0.046124 0.046116 0.003458 0.055751 0.096229 0.068852
polarizability: 1.69080691e+02 -1.28828469e+01 9.06428956e+01 8.64752836e-03 1.16594750e-02 9.01781235e+01
1716.lowfreq: -23.5803 -0.0003 0.0004 0.0004 4.8871 5.0898 11.9113 41.5328 61.1758
frequency: -23.4787 41.4208 61.1726 170.6534 197.4263 199.9001 209.1770 258.0861 347.6513 389.8193 407.7466 449.8547 523.1212 540.9867 545.7797 609.1044 609.6563 660.4219 686.3968 688.7115 689.9709 769.1946 779.1786 794.1340 833.6935 880.5491 916.3851 971.1430 986.7597 989.6932 996.0051 1000.9695 1021.3187 1075.9666 1152.3275 1173.9022 1177.7363 1222.3523 1306.3385 1307.7220 1314.4573 1385.4672 1416.4989 1443.0258 1446.9566 1468.7531 1501.5996 1600.2029 1611.3226 3139.2793 3149.3984 3161.7333 3170.9460 3179.5200
redmass: 4.3404 7.7422 7.3152 10.9577 15.2713 14.0097 5.6485 8.4800 14.3620 6.5423 2.8743 4.9646 6.6723 12.9935 13.4388 9.6653 6.5491 6.6280 12.3705 12.3389 2.0245 1.9318 12.6288 5.4304 1.2488 13.8893 1.4266 1.3782 7.7434 8.8477 1.3902 8.7389 2.1337 1.4982 2.7915 1.0557 1.2871 11.9288 1.3128 12.3456 12.6240 10.2362 12.3027 2.2158 12.5252 2.3769 10.2461 6.2431 7.0605 1.0855 1.0893 1.0934 1.0972 1.1015
irintensity: 0.0150 0.0236 0.6342 0.4741 2.5992 0.2154 0.3129 1.9110 0.6796 4.2008 0.0853 7.3715 1.9433 0.2206 0.2247 13.7922 0.0526 9.3043 0.0470 0.3975 41.2629 55.1348 20.4292 13.9143 0.0064 1.0520 2.2137 0.0480 44.4630 79.8681 2.3272 49.9015 50.9524 11.7085 149.4865 0.0361 48.1304 59.0074 0.0691 482.6824 128.3382 1.6135 115.0179 5.3217 485.7954 191.6784 694.9047 6.2214 6.3770 0.1170 7.4023 20.4039 9.6559 5.4259
temp: 298.150 k
press: 1.00000 atm
elementType: 9 9 8 7 7 7 6 6 6 6 6 6 6 6 6 1 1 1 1 1
symmnumber: 1
zpe: 338732.1 jmol-1
zpe.correction: 0.129016 hartree
zpe.thermalcorrener: 0.139738 hartree
zpe.thermalcorrenthalpy: 0.140683 hartree
zpe.thermalcorrgfe: 0.091174 hartree
zpe.sumelectzpe: -784.042778 hartree
zpe.sumelectthermal: -784.032056 hartree
zpe.sumelectthermalent: -784.031112 hartree
zpe.sumelectthermalfe: -784.080620 hartree
dipole: -4.5851 0.4213 -0.0009
dipole: 4.6044
quadrupole: -83.9880 -97.3119 -73.7330
quadrupole: -2.7319 -0.0003 0.0068
quadrupole: 1.0230 -12.3009 11.2780 -2.7319 -0.0003 0.0068
hfenergy: -784.1717943 hartree
pointgroup: C01 [X(C9H5F2N3O1)]
dipole: -1.8033252 -0.1719881 0.0002934 debye
dipolederiv: -0.25405 0.0053215 0.0000018 0.1864653 -1.0513349 -0.000106 0.0001526 -0.0007912 -0.1783011 -0.9971264 -0.3622399 0.0000294 -0.4225115 -0.427312 0.0000155 -0.0000811 0.0000212 -0.1798446 -2.0970978 0.1567725 -0.0000672 0.2878297 -0.4074807 -0.0000018 0.00001 0.0000338 -0.2699156 -1.5950421 0.028195 -0.000016 0.0286861 -0.4432836 0.0000217 0.0000064 -0.0000798 -0.1550226 -0.988465 0.2901499 0.0002012 0.7235472 -0.932184 -0.0000059 -0.0000895 -0.0001225 -0.1073276 -0.8167531 -0.288578 -0.0002091 -0.2200811 -1.0213604 -0.0000444 0.000161 -0.0000921 -0.1510992 1.4153154 0.0963411 0.0000489 0.4939758 0.083297 0.0000417 0.0000651 0.0000323 0.2245401 -0.2831361 0.0423109 0.0664703 -0.0550661 -0.1013354 0.0145017 0.0608196 0.0454629 -0.0292099 -0.2831159 0.0422924 -0.0665356 -0.0551042 -0.101358 -0.0144495 -0.0609016 -0.0454229 -0.0292371 0.0000163 0.0632458 -0.0701203 0.0763289 -0.1036012 -0.0311512 -0.0436525 -0.0344323 0.0975175 -0.0000088 0.0632586 0.0700625 0.0763351 -0.1035644 0.0312571 0.0435721 0.0345319 0.0975436 0.0569355 0.1083878 0.0000061 0.0884576 -0.1065166 0.0000237 0.0000151 0.0000263 -0.0908551 2.408358 -0.2696037 0.0000618 -0.8566914 0.9804885 -0.0001141 -0.0000642 -0.0000016 0.2096945 1.3480273 0.0169982 -0.0000009 -0.3059341 1.7587757 0.0002623 -0.0002131 0.0009617 0.2811858 1.9072026 0.2830562 -0.0000321 0.258331 1.2894741 -0.0000606 0.0001006 0.0000486 0.2727285 0.0894827 -0.0534888 -0.0725209 -0.0486678 0.1398039 -0.0238699 -0.0857037 -0.0224415 0.0080071 0.0894152 -0.0534686 0.0725684 -0.0486487 0.1398122 0.0237974 0.0857561 0.022375 0.008033 0.0357445 -0.0369067 0.0698208 -0.0505325 0.1425736 0.0288478 0.0818982 0.0280203 -0.0499333 0.0357996 -0.0369208 -0.0697626 -0.0505562 0.1425501 -0.0289412 -0.0818452 -0.0281076 -0.0499563 -0.0715017 -0.0951232 -0.0000066 -0.1061633 0.122556 -0.0000242 -0.0000061 -0.0000222 0.0914522 unknown
polarizability: 168.9906602|13.1537653|90.7329196|-0.0035279|0.0119856|90.1781306 unknown
InChI: InChI=1S/C9H5F2N3O/c10-7-12-8(11)14-9(13-7)15-6-4-2-1-3-5-6/h1-5H
charge 0 multiplicity 1
20 atoms
F  1.990874 -2.748103 -0.000582
F  4.279393 1.265244 0.000059
O  -0.32786 1.307271 0.000128
N  1.97297 1.327537 0.000205
N  0.769412 -0.787854 0.000162
N  3.193019 -0.77375 0.000089
C  -1.608962 0.629909 0.000011
C  -2.225472 0.364386 1.234403
C  -2.22504 0.363897 -1.234491
C  -3.517016 -0.209206 1.225453
C  -3.516588 -0.209689 -1.225771
C  -4.16116 -0.498245 -0.000215
C  0.822275 0.581659 0.000173
C  1.981245 -1.370259 0.000453
C  3.085937 0.577807 0.000036
H  -1.712582 0.603279 2.17088
H  -1.711824 0.60242 -2.170885
H  -4.016753 -0.426928 2.175005
H  -4.015988 -0.427786 -2.175414
H  -5.16228 -0.941589 -0.0003
