program: Gaussian 09
title: 000035630
version: EM64L-G09RevD.01
frameworkgroup: C1[X(C9H4Cl2N4O3)]
method: RPBEPBE
basis: SDD
operation: Freq
keyword: #p
keyword: freq=noraman
keyword: PBEPBE/SDD
title: #p freq=noraman PBEPBE/SDD
converged: NO NO NO NO
title: Mulliken charges:
elementType: Cl Cl O O O N N N N C C C C C C C C C H H H H
charge: 0.066884 0.070585 -0.237142 -0.198913 -0.198915 0.025266 0.082461 0.023186 0.130586 0.428756 0.394684 -0.316844 -0.316854 -0.329721 -0.329720 0.081475 -0.234646 -0.262671 0.266230 0.266234 0.294538 0.294541
chargesum: 0.00000
title: Mulliken charges with hydrogens summed into heavy atoms:
elementType: Cl Cl O O O N N N N C C C C C C C C C
charge: 0.066884 0.070585 -0.237142 -0.198913 -0.198915 0.025266 0.082461 0.023186 0.130586 0.428756 0.394684 -0.050614 -0.050619 -0.035182 -0.035180 0.081475 -0.234646 -0.262671
polarizability: 2.50301756e+02 -2.49879995e+01 1.28805197e+02 9.49283701e-03 1.98459682e-03 1.12345013e+02
1716.lowfreq: -25.1946 -6.5455 -0.0015 -0.0012 -0.0008 2.3179 4.4225 25.5235 32.1463
frequency: -25.1506 25.2794 32.1296 67.0832 110.8279 136.4440 157.5129 162.4427 172.9966 210.8360 223.4253 283.3524 369.2079 385.9383 388.1071 411.3523 430.8065 469.3236 482.0890 508.0127 610.0677 622.0645 625.4957 638.9099 661.5415 666.3585 732.4864 750.8993 787.1059 793.8919 813.4418 834.3888 866.1870 878.4778 937.8794 981.7303 989.0045 1000.8700 1087.3207 1101.3308 1151.3115 1174.2847 1180.9616 1201.9008 1217.5891 1235.5834 1283.1137 1354.3425 1365.4485 1402.9674 1415.4721 1419.1795 1446.6413 1472.5187 1601.1528 1609.6646 3172.4701 3172.7042 3190.8745 3193.6320
redmass: 5.0761 12.7805 15.7697 9.5256 9.7481 15.2643 12.9920 14.3528 18.8829 16.9195 9.1837 8.1965 10.8249 21.4753 7.3358 2.9385 15.7979 7.3904 4.9594 6.9239 8.4063 7.2644 12.2201 8.0428 12.2960 4.4166 5.5830 8.8933 12.5652 10.4631 7.4514 1.2440 1.7837 13.5650 10.1198 1.3543 1.3652 2.9937 3.1986 1.2518 2.0933 1.9517 10.5661 9.7934 8.3534 12.4664 1.2594 12.4717 8.1805 8.1703 12.8241 4.6634 6.9467 2.8690 6.5056 8.4945 1.0904 1.0901 1.0965 1.0977
irintensity: 0.0428 0.4641 0.7658 0.0028 4.6525 0.0461 0.1484 0.5461 0.1890 0.3156 4.7344 0.9247 3.7112 2.9089 3.3903 0.0689 9.7053 6.2691 3.5023 0.1458 8.9493 0.2886 0.0002 2.1761 1.6628 28.2438 2.7477 46.3409 7.5840 36.4035 97.0666 0.0189 85.8832 1.3990 171.7937 1.3380 0.0358 44.3246 3.0738 20.4250 309.2033 53.6386 313.4012 113.1086 278.7599 86.3482 1.4859 317.2951 95.0298 5.1906 569.7364 41.8368 1085.8995 44.9573 50.8522 6.1613 0.8729 0.5144 1.2408 7.0527
temp: 298.150 k
press: 1.00000 atm
elementType: 17 17 8 8 8 7 7 7 7 6 6 6 6 6 6 6 6 6 1 1 1 1
symmnumber: 1
zpe: 332971.2 jmol-1
zpe.correction: 0.126822 hartree
zpe.thermalcorrener: 0.141081 hartree
zpe.thermalcorrenthalpy: 0.142025 hartree
zpe.thermalcorrgfe: 0.082891 hartree
zpe.sumelectzpe: -1708.773620 hartree
zpe.sumelectthermal: -1708.759361 hartree
zpe.sumelectthermalent: -1708.758417 hartree
zpe.sumelectthermalfe: -1708.817551 hartree
dipole: 1.7177 -1.0342 -0.0006
dipole: 2.0050
quadrupole: -154.4958 -122.6562 -106.6976
quadrupole: 5.9319 0.0010 0.0010
quadrupole: -26.5460 5.2937 21.2523 5.9319 0.0010 0.0010
hfenergy: -1708.900442 hartree
pointgroup: C01 [X(C9H4Cl2N4O3)]
dipole: 0.6821322 0.3961827 0.0002708 debye
dipolederiv: -0.0925584 -0.1075925 -0.0000379 0.0333294 -0.8660665 -0.0003864 -0.000003 -0.0008919 -0.0323996 -0.8657779 -0.3217576 0.0002549 -0.3339656 -0.2042903 0.0000946 0.0007415 0.0003221 -0.0297637 -2.3642325 0.358041 0.0002418 0.4572713 -0.5275554 -0.0000982 0.0000529 -0.0000119 -0.2669619 -0.7228916 -0.1009168 0.186772 -0.1494125 -0.2500088 0.0560364 0.1952197 0.0343466 -0.6582682 -0.7229569 -0.1007938 -0.1868166 -0.1492993 -0.2499503 -0.0557324 -0.1953165 -0.0340395 -0.6582696 1.7805662 0.3398274 0.0000453 0.4711426 0.2927515 -0.0003164 0.0001027 -0.0003218 1.086176 -1.9070697 0.0904578 0.0004048 0.1873428 -0.5103267 -0.0002781 0.0002607 -0.0000393 -0.1282797 -1.0230162 0.3389978 0.000378 0.7982701 -1.2502726 -0.0004243 0.0000914 -0.000263 -0.0857658 -1.0784218 -0.5656514 -0.0001881 -0.4770129 -1.2791588 -0.0000359 0.0004134 -0.0003301 -0.0824611 1.7946673 -0.0775148 -0.0001414 0.3969757 0.0608714 -0.0000876 0.0000376 -0.000071 0.3109442 -0.6437759 -0.1263691 0.0000118 -0.213884 0.0185078 0.0000249 -0.0000219 0.0000263 0.0216063 -0.4631613 0.0376851 0.1501898 -0.0818741 -0.0924287 0.0309409 0.2245988 0.0614926 -0.0238951 -0.4631971 0.0377474 -0.1500979 -0.0817328 -0.092376 -0.0309728 -0.224601 -0.0615322 -0.0238997 0.1751886 0.0600854 -0.103761 0.1021624 -0.0694446 -0.0330237 0.2089982 0.0246445 -0.0218971 0.1751479 0.0600293 0.1037658 0.1022959 -0.0694453 0.0329709 -0.208953 -0.0246808 -0.0218762 2.5656086 -0.3883776 -0.0002479 -1.0404151 1.1885184 0.0002587 -0.0002519 0.0001781 0.2460684 1.2900754 0.1893481 -0.0000317 -0.2349743 2.0171051 0.0009224 -0.0002925 0.0010862 0.0809457 2.2028822 0.3857067 -0.0006948 0.3442966 1.2571658 -0.0000184 -0.0010278 -0.0000226 0.0697131 0.0772139 -0.0450496 -0.0589118 -0.0435995 0.1464097 -0.008746 -0.0859954 -0.0053104 0.0318179 0.0772326 -0.0450776 0.0588771 -0.0436401 0.1464024 0.008815 0.0859599 0.0053735 0.0318054 0.1042386 -0.0094269 0.0505615 -0.0216375 0.166792 0.0146963 0.0131595 0.0062866 0.0773295 0.1042381 -0.0093983 -0.0505737 -0.021639 0.1668001 -0.01464 -0.0131733 -0.0062419 0.0773313 unknown
polarizability: 251.0599538|23.0587643|128.0469945|-0.0189968|0.0036102|112.3450178 unknown
InChI: InChI=1S/C9H4Cl2N4O3/c10-7-12-8(11)14-9(13-7)18-6-3-1-5(2-4-6)15(16)17/h1-4H
charge 0 multiplicity 1
22 atoms
Cl 2.544818 -3.270849 -0.001562
Cl 5.758247 1.031326 -0.001139
O  0.789988 1.465264 0.000268
O  -5.192495 -0.463562 1.14138
O  -5.192666 -0.462777 -1.141033
N  -4.615397 -0.287609 0.00019
N  3.079301 1.204958 0.000231
N  1.626538 -0.744698 0.000049
N  4.029648 -1.026929 -0.000398
C  -0.54924 0.940712 0.000252
C  -3.191403 0.142233 0.000211
C  -1.195634 0.751105 1.23639
C  -1.195795 0.751738 -1.235896
C  -2.542558 0.341302 1.238555
C  -2.54272 0.341943 -1.238109
C  1.854236 0.602026 0.000155
C  2.756003 -1.489335 0.000052
C  4.108047 0.332167 0.000145
H  -0.654987 0.926136 2.170469
H  -0.655256 0.927247 -2.169948
H  -3.09414 0.177034 2.167329
H  -3.094435 0.178169 -2.166892
