program: Gaussian 09
title: 000000649
version: EM64L-G09RevD.01
frameworkgroup: C1[X(C4H6N2O2)]
method: RPBEPBE
basis: SDD
operation: Freq
keyword: #pfreq=noraman
keyword: PBEPBE/SDD
title: #p freq=noraman PBEPBE/SDD
converged: NO YES NO NO
title: Mulliken charges:
elementType: O O N N C C C C H H H H H H
charge: -0.221351 -0.260964 -0.349012 -0.386936 -0.383381 -0.455566 0.176226 0.199931 0.237949 0.235728 0.250543 0.257682 0.340852 0.358300
chargesum: 0.00000
title: Mulliken charges with hydrogens summed into heavy atoms:
elementType: O O N N C C C C
charge: -0.221351 -0.260964 -0.008160 -0.028636 0.090296 0.052658 0.176226 0.199931
polarizability: 7.88049976e+01 -1.95186215e+00 6.54447175e+01 1.06859028e+00 7.07289674e-01 3.67974744e+01
1716.lowfreq: -13.4911 -12.2522 -2.8084 -0.0015 -0.0014 -0.0012 124.7019 151.7980 231.5706
frequency: 124.7010 151.7954 231.5664 358.5738 436.6322 476.4873 512.6734 551.2779 568.9956 671.7713 700.2561 757.4261 785.3510 917.4646 931.8714 985.1759 1059.0674 1117.4125 1184.4972 1220.0440 1285.4829 1317.6016 1346.6439 1364.6905 1394.0223 1416.7226 1441.3164 1491.5871 1645.3788 1678.3971 2968.9042 3009.3541 3068.9346 3101.7831 3528.3857 3580.2436
redmass: 4.1296 5.4357 2.2481 10.1770 3.1939 6.0701 4.9213 1.1969 2.9218 2.6517 4.2124 2.0053 2.2196 3.0243 2.5558 2.4741 1.9878 2.0716 1.5491 1.5132 2.0360 1.3283 2.3260 1.9068 1.8167 1.7840 1.0964 1.1073 8.3717 5.3007 1.0693 1.0650 1.0955 1.0970 1.0768 1.0778
irintensity: 2.7517 0.9480 2.2663 21.4222 15.4469 5.2646 11.6392 103.1543 12.4875 21.0021 0.8928 127.2635 42.2387 7.3343 2.4214 4.8371 1.9806 62.0616 68.3615 23.2913 115.0780 10.6167 124.3776 4.3089 80.6108 64.4564 15.6604 21.4306 275.8744 507.9756 53.9061 9.8492 24.9361 8.9529 50.7423 46.5430
temp: 298.150 k
press: 1.00000 atm
elementType: 8 8 7 7 6 6 6 6 1 1 1 1 1 1
symmnumber: 1
zpe: 283410.2 jmol-1
zpe.correction: 0.107945 hartree
zpe.thermalcorrener: 0.114776 hartree
zpe.thermalcorrenthalpy: 0.115720 hartree
zpe.thermalcorrgfe: 0.076783 hartree
zpe.sumelectzpe: -415.406378 hartree
zpe.sumelectthermal: -415.399547 hartree
zpe.sumelectthermalent: -415.398603 hartree
zpe.sumelectthermalfe: -415.437540 hartree
dipole: 0.0700 4.6856 -0.1563
dipole: 4.6887
quadrupole: -61.2826 -41.4533 -45.8426
quadrupole: 1.3220 -1.1379 0.4685
quadrupole: -11.7564 8.0729 3.6835 1.3220 -1.1379 0.4685
hfenergy: -415.514323 hartree
pointgroup: C01 [X(C4H6N2O2)]
dipole: -0.0233896 1.8434191 0.0643233 debye
dipolederiv: -1.1113702 0.1873421 0.0074809 0.3591223 -0.6466639 0.0265717 -0.0389037 0.0465389 -0.3586121 -1.1315125 -0.3397166 -0.025841 -0.2918707 -0.7998689 -0.03294 -0.0332534 -0.0429746 -0.3930711 -0.4528615 -0.0831441 0.0074138 -0.1216632 -1.092785 -0.0495173 0.0356439 0.117357 -0.5164481 -1.6211545 0.2025935 0.0194967 -0.1107867 -0.4343476 0.0147831 0.0587412 0.0383968 -0.3742295 0.3629965 0.2370164 0.1212832 0.1104163 0.2730835 0.0615895 0.0498148 0.0191008 0.3865155 -0.0167187 0.003228 0.0106121 0.0348071 -0.2761431 0.0705734 0.0240859 0.0935519 0.0793336 1.7799406 -0.143974 -0.0657634 0.1322084 0.8724608 -0.1537761 -0.0483796 -0.1589754 0.2346975 1.8183394 0.066203 0.0533924 -0.0351762 1.6947701 0.0515761 0.0769441 -0.0143505 0.3212496 -0.0083657 -0.0880538 -0.0283583 -0.0227168 0.0487562 0.0001001 -0.0465647 -0.1007146 -0.1704574 0.0533588 0.0386705 -0.024443 0.0046279 -0.1392926 0.0406131 -0.0236121 0.0801819 0.0733402 -0.0412343 -0.0648518 -0.0426698 -0.0367426 0.0655293 -0.0222786 -0.054429 -0.0505291 0.0983638 0.096476 0.0399437 -0.0186947 0.0142934 0.0569138 -0.007203 0.0252433 -0.0001924 -0.0810176 0.1427848 -0.0430561 -0.018274 -0.0447827 0.1721034 -0.0153207 -0.0036181 -0.0395105 0.3571311 0.1293213 -0.0122007 0.004365 0.0082635 0.2054842 0.0152287 -0.0217124 0.0121198 0.3432044 unknown
polarizability: 78.8327926|1.9174827|65.439645|0.5184141|-0.6953213|36.7747519 unknown
InChI: InChI=1S/C4H6N2O2/c7-3-1-2-5-4(8)6-3/h5-6H,1-2H2
charge 0 multiplicity 1
14 atoms
O  2.318435 -1.100764 0.039907
O  -2.339478 -1.049227 -0.072262
N  -1.220322 1.009484 -0.034245
N  -0.003976 -1.00742 0.119879
C  0.002518 1.766733 0.292834
C  1.225961 1.078176 -0.343348
C  1.262876 -0.419083 -0.037325
C  -1.277471 -0.371735 0.000483
H  0.138577 1.834926 1.392007
H  -0.100496 2.793497 -0.097236
H  2.166388 1.522959 0.019102
H  1.200068 1.195694 -1.443763
H  -2.12123 1.483542 -0.098191
H  -0.038849 -2.024782 0.238957
