program: Gaussian 09
title: 000035634
version: EM64L-G09RevD.01
frameworkgroup: C1[X(C11H15ClO)]
method: RPBEPBE
basis: SDD
operation: Freq
keyword: #p
keyword: freq=noraman
keyword: PBEPBE/SDD
title: #p freq=noraman PBEPBE/SDD
converged: YES YES NO NO
title: Mulliken charges:
elementType: Cl O C C C C C C C C C C C H H H H H H H H H H H H H H H
charge: -0.072636 -0.456164 0.178216 0.347932 -0.751763 -0.725318 -0.725432 0.182100 -0.323720 -0.634357 0.584930 -0.373997 -0.804308 0.217319 0.220694 0.217286 0.212075 0.203397 0.261528 0.203311 0.212055 0.261705 0.278470 0.219949 0.246564 0.218439 0.246568 0.355158
chargesum: 0.00000
title: Mulliken charges with hydrogens summed into heavy atoms:
elementType: Cl O C C C C C C C C C C C
charge: -0.072636 -0.101006 0.178216 0.347932 -0.096465 -0.048318 -0.048361 0.182100 -0.045251 -0.414409 0.584930 -0.373997 -0.092736
polarizability: 1.75534603e+02 2.77412546e+00 1.40043392e+02 -3.14814565e-03 3.75608048e-03 8.18401508e+01
1716.lowfreq: -0.0021 -0.0013 0.0004 2.7494 7.5402 12.8423 65.8621 77.5282 118.7850
frequency: 65.8059 77.5115 118.7550 148.7087 165.4767 203.0222 223.9857 229.6198 248.4016 265.5304 289.4224 308.5150 325.5433 330.6176 343.1662 365.0853 366.7869 413.0464 418.0688 486.4902 495.0899 554.2941 601.4447 626.5463 687.4382 721.9919 725.5025 832.1051 835.7690 890.1627 922.7219 935.6076 950.3687 968.9522 1004.3059 1025.4506 1034.3011 1043.2668 1074.9242 1147.1234 1187.5010 1204.5114 1213.5017 1250.7940 1277.0289 1288.0571 1357.3542 1373.1481 1375.6585 1383.5705 1401.3874 1403.9087 1457.2111 1461.0865 1471.2236 1471.4949 1475.8393 1479.5874 1491.9156 1498.4008 1507.0100 1572.1221 1617.8289 2972.9656 2976.4353 2980.9789 2984.6688 3063.1257 3065.0529 3067.8160 3069.4088 3077.5221 3092.2008 3101.5842 3106.8149 3109.9377 3184.3442 3572.7997
redmass: 3.5764 3.4938 1.0392 4.4838 5.5279 1.3051 2.0393 3.1968 1.0973 3.1247 4.1353 3.7464 1.0509 4.3023 1.2362 4.6005 2.0998 3.0986 2.9926 3.4733 2.8400 3.6045 5.7574 4.8685 5.3598 6.4444 3.6058 2.5793 1.4789 1.4197 1.7068 1.6877 1.2089 3.6450 1.5745 1.3886 1.3783 1.5064 3.6714 1.6333 1.6275 2.9383 2.3665 2.1831 4.2207 1.5225 4.7419 1.1808 1.2367 4.5340 1.2498 1.2512 1.0474 1.0449 1.1158 1.1601 1.0486 1.0647 1.0511 2.4399 1.0774 5.9125 7.7059 1.0356 1.0363 1.0370 1.0367 1.1003 1.0974 1.0992 1.0997 1.0981 1.0998 1.0909 1.0984 1.0977 1.0905 1.0659
irintensity: 0.0159 1.3847 0.4097 0.8057 0.1352 0.0019 0.2891 1.9510 0.1882 0.7352 0.5561 5.4491 0.1781 0.0814 90.3624 5.1817 23.5026 0.1511 13.3202 6.4412 0.0644 2.1172 28.9142 0.1042 23.9649 0.3545 0.0127 12.4662 22.0610 13.6174 3.0392 3.7522 0.2723 7.5930 6.7857 0.9729 0.0981 10.2787 129.8689 141.2761 8.7732 7.1730 1.0164 33.2366 22.0526 21.9742 58.3750 24.5581 9.2803 54.0496 5.4761 17.3286 0.2356 14.1997 30.5852 6.1598 0.0080 7.2810 11.2066 40.6007 28.2408 0.1169 3.3324 22.2108 42.5674 49.3379 21.5346 4.2706 13.1867 24.4498 51.2540 86.5077 12.8219 23.1749 0.8835 23.8899 0.4116 27.7191
temp: 298.150 k
press: 1.00000 atm
elementType: 17 8 6 6 6 6 6 6 6 6 6 6 6 1 1 1 1 1 1 1 1 1 1 1 1 1 1 1
symmnumber: 1
zpe: 604812.3 jmol-1
zpe.correction: 0.230361 hartree
zpe.thermalcorrener: 0.244575 hartree
zpe.thermalcorrenthalpy: 0.245519 hartree
zpe.thermalcorrgfe: 0.190606 hartree
zpe.sumelectzpe: -962.465504 hartree
zpe.sumelectthermal: -962.451289 hartree
zpe.sumelectthermalent: -962.450345 hartree
zpe.sumelectthermalfe: -962.505259 hartree
dipole: 0.4513 2.6005 0.0004
dipole: 2.6394
quadrupole: -87.5307 -75.3004 -88.9175
quadrupole: -6.6170 0.0012 0.0005
quadrupole: -3.6145 8.6158 -5.0013 -6.6170 0.0012 0.0005
hfenergy: -962.6958646 hartree
pointgroup: C01 [X(C11H15Cl1O1)]
dipole: -0.0579975 1.0367955 0.0050605 debye
polarizability: 174.4177385|-6.7816377|141.1548766|0.5842779|0.2727068|81.8455304 unknown
InChI: InChI=1S/C11H15ClO/c1-7-5-10(13)8(6-9(7)12)11(2,3)4/h5-6,13H,1-4H3
charge 0 multiplicity 1
28 atoms
Cl 2.947813 -2.166143 0.007334
O  -1.121607 2.27839 0.004451
C  -2.139729 -0.476841 -0.018157
C  -0.635829 -0.114019 -0.005865
C  -2.363015 -2.012125 -0.026879
C  -2.810959 0.112004 -1.297264
C  -2.829115 0.100101 1.256506
C  -0.167761 1.234867 0.004645
C  0.370766 -1.11135 -0.00434
C  1.210858 1.546106 0.015368
C  2.211252 0.543959 0.016582
C  1.739322 -0.786205 0.006472
C  3.683647 0.896905 0.028294
H  -1.940471 -2.498194 0.872256
H  -3.448725 -2.217397 -0.035587
H  -1.927518 -2.489894 -0.924251
H  -2.354254 -0.314478 -2.209676
H  -3.888304 -0.139652 -1.301979
H  -2.708725 1.208085 -1.332617
H  -3.906214 -0.152808 1.244485
H  -2.384489 -0.333855 2.171365
H  -2.729003 1.195963 1.302808
H  0.087254 -2.165405 -0.011635
H  1.527086 2.59874 0.023241
H  4.200538 0.481741 -0.856205
H  3.829057 1.990115 0.034361
H  4.188402 0.473623 0.915964
H  -0.668178 3.157866 0.012123
