program: Gaussian 09
title: 000035608
version: EM64L-G09RevD.01
frameworkgroup: C1[X(C2H3Cl3N2)]
method: RPBEPBE
basis: SDD
operation: Freq
keyword: #p
keyword: freq=noraman
keyword: PBEPBE/SDD
title: #p freq=noraman PBEPBE/SDD
converged: YES YES NO NO
title: Mulliken charges:
elementType: Cl Cl Cl N N C C H H H
charge: 0.162153 0.064964 0.091775 -0.595266 -0.294573 -0.634292 0.308245 0.333222 0.330634 0.233139
chargesum: 0.00000
title: Mulliken charges with hydrogens summed into heavy atoms:
elementType: Cl Cl Cl N N C C
charge: 0.162153 0.064964 0.091775 0.068589 -0.061435 -0.634292 0.308245
polarizability: 6.01577467e+01 2.03784186e+00 7.65844295e+01 -1.02019414e+00 -2.84818343e-01 5.62936022e+01
1716.lowfreq: -7.8415 0.0018 0.0036 0.0039 5.8936 15.4220 34.9539 181.2204 193.7026
frequency: 34.8020 181.2198 193.7026 259.1815 262.4781 285.7384 368.1163 386.6255 389.7692 439.5442 543.8910 564.6062 732.9882 772.5076 817.9509 922.7715 1022.8612 1055.7347 1356.3024 1610.4135 1645.5011 3351.0806 3530.1031 3678.1609
redmass: 5.0646 8.7862 12.6369 10.1248 14.8831 11.8925 1.0477 12.7638 6.1821 1.3266 2.7585 5.4636 8.4914 9.0570 1.2811 6.0141 1.5545 1.6380 3.5455 1.5921 2.4665 1.0775 1.0460 1.1037
irintensity: 6.3423 2.9011 2.5548 4.2490 3.6886 1.6157 3.2653 3.2425 4.6882 175.0609 43.5331 116.2063 114.7477 163.5319 200.7964 41.6502 104.7087 9.3066 78.5329 51.8674 188.2969 17.0028 40.2226 37.2290
temp: 298.150 k
press: 1.00000 atm
elementType: 17 17 17 7 7 6 6 1 1 1
symmnumber: 1
zpe: 145980.6 jmol-1
zpe.correction: 0.055601 hartree
zpe.thermalcorrener: 0.063862 hartree
zpe.thermalcorrenthalpy: 0.064806 hartree
zpe.thermalcorrgfe: 0.021386 hartree
zpe.sumelectzpe: -1567.118666 hartree
zpe.sumelectthermal: -1567.110405 hartree
zpe.sumelectthermalent: -1567.109461 hartree
zpe.sumelectthermalfe: -1567.152881 hartree
dipole: -3.9178 -1.9342 -0.1398
dipole: 4.3715
quadrupole: -48.5132 -63.7082 -64.0213
quadrupole: 1.8001 0.2593 0.1140
quadrupole: 10.2344 -4.9606 -5.2738 1.8001 0.2593 0.1140
hfenergy: -1567.1742668 hartree
pointgroup: C01 [X(C2H3Cl3N2)]
dipole: 1.2478572 1.1746753 0.1448293 debye
dipolederiv: -0.1546688 -0.2342061 -0.0886142 -0.1809801 -0.5256715 -0.1632156 -0.0595668 -0.1603674 -0.1671393 -0.2543789 0.1482118 -0.1376463 0.1420081 -0.5820455 0.3219486 -0.1121343 0.2832454 -0.40916 -0.2414371 0.0339286 0.1711808 0.0516523 -0.192132 -0.1486753 0.1596685 -0.1241565 -0.7755475 -0.4898555 -0.4167959 -0.0282385 -0.1488492 -0.9818956 -0.0632946 0.0101611 -0.1076208 -0.654208 -0.3566907 0.374628 0.0680315 0.3241158 -0.8280006 -0.0657753 0.0473529 -0.0317045 -0.4722875 0.606727 -0.0348268 0.0477016 -0.0120647 1.3268604 -0.0251224 0.0615578 -0.0333032 1.4322446 0.6200217 0.1029657 -0.012995 -0.015112 1.1395133 0.1964548 -0.0857695 0.2087132 -0.0163415 0.2456112 0.0386771 -0.0063148 0.0407504 0.1950259 -0.0211019 0.0100567 0.0078262 0.3751959 0.1340811 0.0513279 -0.0041114 0.0297491 0.1809857 -0.0246162 -0.0004673 -0.0266593 0.3764544 -0.1094101 -0.0639104 -0.0089937 -0.2312696 0.2673598 -0.0066022 -0.0308591 -0.0159731 0.3107888 unknown
polarizability: 60.4023877|-3.0889904|75.7355265|0.5437874|3.3382568|56.8978643 unknown
InChI: InChI=1S/C2H3Cl3N2/c3-2(4,5)1(6)7/h6H,7H2
charge 0 multiplicity 1
10 atoms
Cl -1.277964 -1.602998 -0.589681
Cl -1.208001 1.369996 -1.119322
Cl -1.07984 0.327308 1.729196
N  1.567247 1.220641 0.130884
N  1.603943 -1.179012 -0.268943
C  -0.537065 -0.032325 -0.035468
C  1.00631 -0.031939 -0.084818
H  0.994034 2.061897 0.176154
H  2.577516 1.315964 0.20222
H  2.642219 -1.119831 -0.262422
