program: Gaussian 09
title: 000035627
version: EM64L-G09RevD.01
frameworkgroup: C1[X(C9H4Cl3N3O)]
method: RPBEPBE
basis: SDD
operation: Freq
keyword: #p
keyword: freq=noraman
keyword: PBEPBE/SDD
title: #p freq=noraman PBEPBE/SDD
converged: YES YES NO NO
title: Mulliken charges:
elementType: Cl Cl Cl O N N N C C C C C C C C C H H H H
charge: -0.014944 0.056328 0.061213 -0.225464 0.084852 0.033526 0.125759 0.518539 -0.277289 -0.332825 -0.213487 -0.202315 -0.221657 0.096709 -0.230834 -0.266120 0.263189 0.261166 0.242106 0.241547
chargesum: 0.00000
title: Mulliken charges with hydrogens summed into heavy atoms:
elementType: Cl Cl Cl O N N N C C C C C C C C C
charge: -0.014944 0.056328 0.061213 -0.225464 0.084852 0.033526 0.125759 0.518539 -0.277289 -0.069635 0.047679 0.039791 0.019890 0.096709 -0.230834 -0.266120
polarizability: 2.07600673e+02 2.03541659e+01 1.28763912e+02 -1.86124965e+01 7.09780663e+00 1.12538253e+02
1716.lowfreq: -8.7041 -3.7719 -0.0014 0.0007 0.0020 3.5536 26.5709 29.8677 53.8670
frequency: 26.4657 29.8277 53.8573 132.5442 136.1189 155.5583 170.1501 181.7178 205.0745 246.0080 271.0596 356.8352 385.0853 429.0973 436.6911 453.2765 465.2491 512.7596 593.6828 625.2983 632.5841 661.2716 663.9447 712.3047 763.3195 774.8015 787.9470 814.5774 862.2585 880.3662 938.5360 947.5305 986.0675 1018.5079 1033.5276 1122.7008 1169.8047 1178.1852 1183.7621 1204.4300 1241.5982 1256.2877 1354.8261 1377.3880 1416.1884 1428.2195 1449.1928 1463.8724 1591.5543 1594.0978 3148.0802 3161.1452 3172.7382 3183.0795
redmass: 12.8885 11.4297 8.2212 6.3495 11.7104 15.2490 14.3921 14.8595 11.8981 9.7747 8.2886 8.7826 20.0265 10.9467 6.1023 5.3546 7.8635 4.8340 9.4387 12.3699 6.4181 10.1891 7.6741 3.8413 1.3679 7.5977 12.7100 7.6892 1.4314 13.8001 7.0778 1.4847 1.3301 6.0696 2.2565 1.5632 1.2030 4.4773 4.8402 5.9835 12.1411 1.4496 12.4286 11.1612 11.2697 2.3306 3.8594 4.3906 6.7792 7.4870 1.0863 1.0907 1.0954 1.1010
irintensity: 0.2298 0.5752 0.6960 0.1695 0.0566 0.0030 0.2926 0.3174 0.3850 0.8464 2.0547 1.1369 3.9649 12.3126 2.9602 3.0290 7.0432 0.5947 11.8395 0.0221 6.4268 10.0911 5.9665 8.7615 69.1364 34.8249 16.1131 133.7033 3.9219 0.7523 117.1483 20.4851 0.1363 46.1597 49.6362 3.3836 14.7992 40.0815 411.2244 65.5612 84.0263 6.3790 265.8198 9.0512 555.4778 83.8703 746.5896 236.9861 5.9241 1.4362 1.5060 8.5922 4.1232 8.4797
temp: 298.150 k
press: 1.00000 atm
elementType: 17 17 17 8 7 7 7 6 6 6 6 6 6 6 6 6 1 1 1 1
symmnumber: 1
zpe: 305293.3 jmol-1
zpe.correction: 0.116280 hartree
zpe.thermalcorrener: 0.129981 hartree
zpe.thermalcorrenthalpy: 0.130925 hartree
zpe.thermalcorrgfe: 0.072946 hartree
zpe.sumelectzpe: -1963.860506 hartree
zpe.sumelectthermal: -1963.846805 hartree
zpe.sumelectthermalent: -1963.845861 hartree
zpe.sumelectthermalfe: -1963.903840 hartree
dipole: 4.3929 0.6908 -1.5543
dipole: 4.7106
quadrupole: -100.4152 -119.9852 -104.7282
quadrupole: 3.1274 -3.9155 2.3937
quadrupole: 7.9610 -11.6090 3.6480 3.1274 -3.9155 2.3937
hfenergy: -1963.9767857 hartree
pointgroup: C01 [X(C9H4Cl3N3O1)]
dipole: 1.7133158 -0.5081267 0.4910371 debye
dipolederiv: -0.2622098 0.1237554 -0.2287147 0.0984676 -0.1049948 0.1663572 -0.2153022 0.1802367 -0.4687086 -0.0964395 0.00556 -0.0021115 -0.1033302 -0.789021 -0.2745794 -0.0401796 -0.2791894 -0.1414715 -0.7610837 0.3824818 0.0775674 0.3980992 -0.2922312 -0.0578 0.0746855 -0.0558113 -0.0505906 -2.1141256 -0.1501706 -0.130373 -0.1898709 -0.3784929 -0.066352 -0.3052215 -0.0752505 -0.3055909 -1.8138507 0.0944772 -0.0829932 0.027653 -0.4510097 -0.1247942 -0.1531635 -0.1166652 -0.1831802 -1.0645184 -0.3329518 -0.204445 -0.6699561 -0.9919249 -0.3484315 -0.3792916 -0.3677867 -0.2299108 -0.9150234 0.4919498 0.1084158 0.4358079 -1.2690582 -0.3885745 0.0536322 -0.399811 -0.2214832 1.3025354 -0.0091902 -0.091771 -0.4278064 0.0753519 0.0326266 -0.1488383 0.0327692 0.0287176 0.1197001 -0.2304588 0.4043294 -0.1077883 0.081401 -0.2538134 0.3331722 -0.2999375 0.6377288 -0.2020986 -0.0651341 -0.0097398 0.0188931 -0.0851388 -0.010584 -0.036296 0.0314378 0.0051084 -0.1183467 0.0346179 -0.1417496 0.0153215 -0.1071061 0.0665456 -0.0771086 0.0690873 -0.0811984 -0.0505593 -0.0628472 0.0607631 -0.0724161 -0.1124729 -0.0501474 0.0636675 -0.0482823 0.0435137 0.0530039 -0.1000104 -0.0370759 -0.0851764 -0.09897 0.0000954 -0.0173399 -0.0206264 0.0064301 2.4870223 0.2158517 0.1586695 0.7012392 0.9468501 0.2436006 0.5266302 0.2644288 0.3700378 1.2506101 -0.096576 0.0831739 0.2105462 1.7928325 0.629477 0.2188889 0.6366263 0.324623 2.0312022 -0.4994669 -0.0017795 -0.4776527 1.2204231 0.3831945 0.0295367 0.3921168 0.215994 0.1024339 0.0435897 0.0607951 0.0357272 0.1469806 -0.0018005 0.076145 0.0033172 0.0049758 0.078059 0.0198328 0.034652 0.0318974 0.1539968 0.0031274 0.0555147 0.0019242 -0.0093855 0.033989 0.0475869 -0.0694672 0.0632141 0.1377516 0.0484533 -0.0779274 0.0481894 -0.0261418 -0.0603002 0.0871028 0.0118544 0.0971308 0.124833 0.0033995 0.0187956 0.0032265 0.0805322 unknown
polarizability: 206.220356|-27.5872241|123.3118772|11.2261516|10.2243908|119.3706051 unknown
InChI: InChI=1S/C9H4Cl3N3O/c10-5-3-1-2-4-6(5)16-9-14-7(11)13-8(12)15-9/h1-4H
charge 0 multiplicity 1
20 atoms
Cl 1.188226 0.956307 -2.222167
Cl -2.073848 -2.998639 -1.11097
Cl -4.703985 1.468874 0.28618
O  0.248576 1.099464 0.719257
N  -2.039219 1.212608 0.489501
N  -0.85339 -0.811916 -0.135653
N  -3.256116 -0.693741 -0.384518
C  1.513172 0.455191 0.514358
C  2.091935 0.363585 -0.768625
C  2.22099 0.032818 1.653731
C  3.381323 -0.179911 -0.923405
C  3.516016 -0.509302 1.50363
C  4.091988 -0.618855 0.217221
C  -0.905402 0.468279 0.333899
C  -2.057369 -1.320273 -0.475561
C  -3.162312 0.5699 0.113756
H  1.751515 0.136277 2.636378
H  3.821362 -0.252656 -1.922105
H  4.069348 -0.842205 2.386954
H  5.09489 -1.039804 0.095342
