program: Gaussian 09
title: 000035638
version: EM64L-G09RevD.01
frameworkgroup: C1[X(C9H4Cl3N3S)]
method: RPBEPBE
basis: SDD
operation: Freq
keyword: #p
keyword: freq=noraman
keyword: PBEPBE/SDD
title: #p freq=noraman PBEPBE/SDD
converged: YES YES NO NO
title: Mulliken charges:
elementType: Cl Cl Cl S N N N C C C C C C C C C H H H H
charge: -0.036297 0.053748 0.056873 0.360196 0.097061 0.130925 0.130457 -0.204235 -0.186805 -0.185567 -0.189326 -0.189791 -0.097445 -0.277703 -0.253471 -0.257290 0.260381 0.260077 0.264131 0.264081
chargesum: 0.00000
title: Mulliken charges with hydrogens summed into heavy atoms:
elementType: Cl Cl Cl S N N N C C C C C C C C C
charge: -0.036297 0.053748 0.056873 0.360196 0.097061 0.130925 0.130457 -0.204235 0.073576 0.074510 0.074805 0.074289 -0.097445 -0.277703 -0.253471 -0.257290
polarizability: 2.60992272e+02 -2.23428755e+01 1.49787619e+02 1.70368677e-01 3.45154742e-01 1.00327505e+02
1716.lowfreq: -0.0016 0.0010 0.0023 3.8684 5.9153 9.2442 19.3836 24.2983 29.7733
frequency: 18.8082 24.0576 29.7711 103.7843 125.5176 149.1136 154.9262 155.0547 197.5581 211.0578 280.3873 328.3421 337.8743 368.4434 409.0867 419.8015 432.3255 466.7261 495.7262 537.8836 616.5344 619.1751 623.8911 702.0292 716.5466 773.9260 781.6925 786.5630 827.2110 828.8208 879.8518 954.7570 968.2211 988.6678 1069.6941 1074.2938 1103.5338 1161.4536 1179.3752 1185.5626 1214.1743 1232.7713 1286.0592 1365.6648 1381.6555 1392.7307 1432.4870 1459.2148 1577.5414 1584.2016 3157.8278 3158.4286 3177.8159 3181.1464
redmass: 4.2392 16.0809 21.4914 10.4235 15.1641 13.8113 15.2113 15.3877 21.9515 13.1527 9.3130 4.9595 16.3611 22.0599 2.8749 17.9560 15.2070 6.2321 5.7211 6.6183 12.2745 7.1851 12.3424 3.9953 7.3034 12.9824 12.9887 12.5959 1.2453 1.4762 13.9534 1.3355 1.3747 6.0813 6.7930 1.9193 1.3580 12.6905 1.7653 2.4262 12.6961 11.9289 1.2333 4.6500 4.2006 12.9200 11.2766 2.2553 6.3634 7.9537 1.0897 1.0894 1.0969 1.0980
irintensity: 0.0004 0.0793 0.0881 0.6078 0.0522 0.0445 0.2993 0.3247 0.0386 0.8459 0.1666 0.0770 13.1969 1.7684 0.0124 1.5594 7.6506 11.9782 16.4421 13.9458 0.2522 0.0373 0.0025 1.8399 15.6169 143.8418 143.6072 2.4845 0.3180 81.2518 4.0876 0.0113 0.1452 92.1944 39.9983 23.5625 7.9312 83.1570 152.4768 117.0481 121.6428 5.8509 0.6397 0.2699 11.2734 559.5483 1031.5317 46.1588 25.9274 1.1113 0.6278 1.4726 2.7062 0.3766
temp: 298.150 k
press: 1.00000 atm
elementType: 17 17 17 16 7 7 7 6 6 6 6 6 6 6 6 6 1 1 1 1
symmnumber: 1
zpe: 297210.8 jmol-1
zpe.correction: 0.113202 hartree
zpe.thermalcorrener: 0.127698 hartree
zpe.thermalcorrenthalpy: 0.128642 hartree
zpe.thermalcorrgfe: 0.067660 hartree
zpe.sumelectzpe: -2286.705057 hartree
zpe.sumelectthermal: -2286.690561 hartree
zpe.sumelectthermalent: -2286.689617 hartree
zpe.sumelectthermalfe: -2286.750599 hartree
dipole: -2.0863 -1.0300 0.0070
dipole: 2.3267
quadrupole: -132.1159 -126.9008 -108.9503
quadrupole: 1.3633 0.0514 0.1830
quadrupole: -9.4602 -4.2451 13.7053 1.3633 0.0514 0.1830
hfenergy: -2286.8182589 hartree
pointgroup: C01 [X(C9H4Cl3N3S1)]
dipole: 0.8587853 0.3107967 0.0617678 debye
dipolederiv: -0.7132187 0.2940081 0.1299623 0.3979234 -0.2399509 -0.061858 0.1651326 -0.056687 -0.1425537 -0.0948267 0.1308335 0.0461502 -0.0337027 -0.8035935 -0.2514475 -0.008783 -0.2594443 -0.1279654 -0.9656573 0.2561074 0.1306416 0.2789447 -0.1568982 -0.0525585 0.137664 -0.0513734 -0.0638825 -0.3854206 -0.2715774 -0.0729641 -0.566357 0.0005842 0.037206 -0.1711909 0.0203503 -0.0074041 -2.1093369 -0.1662451 0.0433201 -0.3579723 -0.5115661 -0.1208072 -0.020619 -0.1301816 -0.1381565 -0.924628 -0.3709081 -0.0797911 -0.7906488 -1.3332351 -0.3911851 -0.2212519 -0.4121183 -0.1685351 -1.1246395 0.480567 0.2102427 0.3579012 -1.071438 -0.3416464 0.1690516 -0.3474039 -0.2209999 0.4590102 -0.1063769 -0.0603494 -0.1488257 -0.1611649 -0.0404542 -0.0719682 -0.0418314 -0.0304003 -0.1283575 -0.0917607 0.0808 0.0935523 -0.0319456 -0.0739191 -0.1594589 0.0105841 0.0361111 -0.1190657 -0.0296424 -0.1071686 -0.0229136 -0.0384234 0.0139434 0.1977171 -0.0602591 0.0331095 -0.3441895 0.1267382 -0.0527047 0.148789 -0.1701776 0.0138182 -0.0025506 -0.0126778 0.0101167 -0.3284511 0.0540708 0.1454673 0.1001736 -0.095314 -0.1066363 0.1171327 -0.0761941 -0.0785668 1.0223972 -0.54192 -0.2278813 -0.6512263 0.2961355 0.0761261 -0.2642432 0.0707337 0.1998145 1.8387034 0.4388333 0.0582045 0.9228187 0.9570386 0.2637264 0.2175054 0.2881267 0.1150105 1.2676087 -0.1184758 -0.0971478 0.2375011 1.8377864 0.567779 0.0222862 0.5857442 0.2876409 2.3193472 -0.2904151 -0.2058748 -0.1721353 1.0884061 0.3425359 -0.1651207 0.3480966 0.2090835 0.0968109 0.0822883 -0.0478452 0.0652531 0.0818823 0.0513833 -0.0594728 0.0354624 0.0407358 0.1083415 0.0362343 0.0806978 0.0144106 0.109217 0.003713 0.0788593 0.017078 0.0003939 0.0669654 0.026358 0.0603917 0.0466843 0.1389679 0.0097957 0.0634279 0.0180647 0.0013629 0.0586071 0.0612826 -0.0341513 0.0798299 0.1036894 0.0604855 -0.0241178 0.05393 0.045085 unknown
polarizability: 254.533472|-29.5846987|149.6409065|-17.8953096|17.4965302|106.9330171 unknown
InChI: InChI=1S/C9H4Cl3N3S/c10-5-1-3-6(4-2-5)16-9-14-7(11)13-8(12)15-9/h1-4H
charge 0 multiplicity 1
20 atoms
Cl 5.315408 -1.363653 -0.711127
Cl -1.867002 -2.924396 -0.856671
Cl -5.292283 0.94815 0.597607
S  -0.030236 1.973184 0.684999
N  -2.623095 1.275398 0.576965
N  -1.074597 -0.473333 -0.079713
N  -3.460247 -0.892499 -0.103823
C  1.466262 0.970856 0.272477
C  1.996486 1.025126 -1.034295
C  2.100929 0.220453 1.285302
C  3.175495 0.309245 -1.340457
C  3.280262 -0.498367 0.987666
C  3.796306 -0.441468 -0.322393
C  -1.35819 0.791478 0.354585
C  -2.162672 -1.24678 -0.284491
C  -3.607615 0.388837 0.329615
H  1.499164 1.614193 -1.81055
H  1.684059 0.189613 2.296322
H  3.597724 0.336151 -2.348696
H  3.782941 -1.088288 1.758977
