program: Gaussian 09
title: 000035596
version: EM64L-G09RevD.01
frameworkgroup: C1[X(C4H5N3O3)]
method: RPBEPBE
basis: SDD
operation: Freq
keyword: #pfreq=noraman
keyword: PBEPBE/SDD
title: #p freq=noraman PBEPBE/SDD
converged: NO NO NO NO
title: Mulliken charges:
elementType: O O O N N N C C C C H H H H H
charge: -0.254272 -0.228452 -0.204445 -0.391660 -0.420957 -0.061006 0.246899 0.216368 0.094120 -0.490482 0.371723 0.372466 0.238003 0.255856 0.255841
chargesum: 0.00000
title: Mulliken charges with hydrogens summed into heavy atoms:
elementType: O O O N N N C C C C
charge: -0.254272 -0.228452 -0.204445 -0.019937 -0.048491 -0.061006 0.246899 0.216368 0.094120 0.259217
polarizability: 9.60712815e+01 4.58526422e-02 8.97801878e+01 -9.42882345e-03 -4.45164863e-03 3.59364932e+01
1716.lowfreq: -9.0382 -7.1041 -0.0008 -0.0007 0.0004 6.2369 92.8509 113.3864 142.7406
frequency: 92.8174 113.3790 142.7296 190.8674 192.3676 219.7592 350.4160 413.5531 496.6797 499.6655 608.2407 638.5262 646.7603 659.1512 713.2127 725.1467 771.7982 891.8900 910.2167 1000.8163 1035.2084 1123.6687 1134.0140 1179.0078 1244.8844 1315.1193 1365.1012 1418.7182 1449.2908 1453.6841 1467.1687 1592.1196 1664.1298 1691.7938 3015.6643 3122.6122 3160.2127 3540.1198 3555.8572
redmass: 2.8275 1.1822 7.3416 3.7781 8.0920 6.1394 10.7649 6.2448 9.0136 7.5642 10.7742 1.2699 5.4385 3.2696 2.5928 4.9986 2.8157 8.3524 6.6823 3.8532 4.7036 1.2519 2.3538 2.6358 2.4937 6.6341 1.5383 1.3790 1.0480 1.8741 1.1605 6.9272 7.5856 7.2406 1.0291 1.1051 1.1060 1.0777 1.0787
irintensity: 2.1328 0.1032 0.4753 6.8942 14.6469 3.2500 14.2963 0.5502 10.2662 20.5221 5.6518 85.1084 13.2491 27.7170 2.8895 23.2310 169.2055 23.0030 4.0341 2.9700 80.7976 0.1257 48.4650 19.8339 196.7286 195.5550 11.1316 88.9830 16.6358 158.2217 29.3129 712.7880 414.3797 556.6118 26.0002 16.8072 14.1195 64.7518 93.1164
temp: 298.150 k
press: 1.00000 atm
elementType: 8 8 8 7 7 7 6 6 6 6 1 1 1 1 1
symmnumber: 1
zpe: 273982.9 jmol-1
zpe.correction: 0.104355 hartree
zpe.thermalcorrener: 0.113251 hartree
zpe.thermalcorrenthalpy: 0.114196 hartree
zpe.thermalcorrgfe: 0.070018 hartree
zpe.sumelectzpe: -544.636424 hartree
zpe.sumelectthermal: -544.627527 hartree
zpe.sumelectthermalent: -544.626583 hartree
zpe.sumelectthermalfe: -544.670761 hartree
dipole: -3.5839 -2.6048 0.0025
dipole: 4.4305
quadrupole: -50.9947 -71.0937 -56.2979
quadrupole: 5.1818 0.0023 0.0024
quadrupole: 8.4674 -11.6316 3.1642 5.1818 0.0023 0.0024
hfenergy: -544.7407788 hartree
pointgroup: C01 [X(C4H5N3O3)]
dipole: 1.3769238 -1.0688716 -0.0009814 debye
dipolederiv: -1.6471138 0.1791033 0.0000447 0.3027668 -0.5659149 0.0000169 -0.0000917 0.0000849 -0.3278617 -1.013639 -0.4342128 0.0000472 -0.4092119 -0.8584945 0.0000301 0.0003486 0.000377 -0.3755667 -0.5839643 0.220426 -0.0000299 0.1376273 -1.241046 0.0005431 0.0002533 -0.0011139 -0.365736 -1.4394016 -0.3605634 0.0001958 -0.0987317 -0.6983828 -0.0000104 0.0000481 -0.0000892 -0.3049902 -0.6986625 -0.3033553 -0.0002715 -0.3496727 -1.2802232 0.0000037 0.0002477 0.0003306 -0.3571824 -1.032265 0.4661785 0.0002946 0.6366779 -1.2394629 0.0000886 -0.0002338 0.0001661 -0.2629898 1.8327858 0.037468 -0.0000401 -0.4830442 1.6150524 -0.0001556 -0.0000526 0.0000765 0.2971311 1.8192575 0.4060108 -0.0001979 0.2547866 1.5320501 -0.0001127 -0.0002795 -0.0002327 0.3368563 1.5766259 -0.2217399 -0.0001335 -0.1068562 1.9461131 -0.0004426 -0.0004035 0.0003722 0.3156148 0.7930518 0.0114312 -0.0000061 0.254491 0.228874 -0.0000377 0.0000023 -0.0000051 0.2589746 0.1866673 -0.043291 0.000017 -0.0126572 0.2706989 0.0000204 0.0000137 0.0000036 0.3714726 0.2004816 -0.038287 0.0000773 -0.0495198 0.1745671 0.0000377 0.0001408 0.0000144 0.356687 -0.0608982 0.0668508 -0.0000151 0.1232753 0.0136945 0.0000219 -0.0000199 0.0000174 0.1312675 0.0335429 0.0070031 0.037424 -0.0999612 0.0512304 -0.0810159 -0.0074678 -0.0787684 -0.0368119 0.0335316 0.0069777 -0.0374063 -0.0999699 0.0512438 0.0810126 0.0074943 0.0787666 -0.0368651 unknown
polarizability: 96.0620928|-0.2445912|89.7893765|-0.0092833|0.0047476|35.9364932 unknown
InChI: InChI=1S/C4H5N3O3/c1-10-4-6-2(8)5-3(9)7-4/h5-6H,1H3
charge 0 multiplicity 1
15 atoms
O  2.100893 -1.00115 -0.000256
O  -2.478028 -1.702616 0.000449
O  -0.8264 2.686405 0.000684
N  -0.161784 -1.314275 -0.000342
N  -1.638147 0.498944 -0.000048
N  0.738291 0.918449 -0.000402
C  0.878205 -0.389359 -0.000353
C  -1.516356 -0.898372 -0.000177
C  -0.56806 1.462146 -0.000987
C  3.28369 -0.107291 -0.00022
H  0.032672 -2.318188 -0.000248
H  -2.59174 0.872267 0.000624
H  4.142259 -0.792484 -0.000082
H  3.273069 0.531486 0.897712
H  3.273237 0.531338 -0.898256
