program: Gaussian 09
title: 000035597
version: EM64L-G09RevD.01
frameworkgroup: C1[X(C6H9N3O2)]
method: RPBEPBE
basis: SDD
operation: Freq
keyword: #pfreq=noraman
keyword: PBEPBE/SDD
title: #p freq=noraman PBEPBE/SDD
converged: NO NO NO NO
title: Mulliken charges:
elementType: O O N N N C C C C C C H H H H H H H H H
charge: -0.228612 -0.192941 -0.395243 -0.018221 -0.407154 -0.180701 0.190139 -0.680409 -0.680835 0.204068 0.049497 0.271476 0.195683 0.244376 0.236528 0.244200 0.195379 0.236765 0.346434 0.369572
chargesum: 0.00000
title: Mulliken charges with hydrogens summed into heavy atoms:
elementType: O O N N N C C C C C C
charge: -0.228612 -0.192941 -0.048809 -0.018221 -0.037582 0.090775 0.190139 -0.003822 -0.004491 0.204068 0.049497
polarizability: 1.12753497e+02 -6.40093735e+00 1.03358770e+02 3.43019521e-02 4.39509177e-02 5.85606372e+01
1716.lowfreq: -10.4124 -9.8834 -9.1623 -0.0012 -0.0011 -0.0010 10.7915 96.1792 131.6189
frequency: 6.4868 96.1641 131.6186 167.6407 181.6796 199.9918 231.6619 276.6747 295.5435 367.6167 433.7911 500.5021 526.1367 568.8634 634.2330 637.9701 669.3363 728.5452 743.6431 786.2430 840.1560 898.6137 924.2851 945.8272 960.0700 994.5199 1056.1122 1106.5568 1116.7128 1167.9772 1247.1602 1295.2570 1311.9433 1332.2575 1361.7115 1384.0781 1403.0141 1431.1688 1461.6861 1472.0767 1480.5849 1486.7976 1584.8019 1657.6537 1688.9779 2979.0726 2981.1108 3045.6852 3070.9025 3083.5524 3094.0765 3097.2840 3530.7497 3542.0783
redmass: 3.0487 3.6569 6.6547 3.0113 3.7881 1.2466 1.1252 3.0489 4.1185 9.1158 3.0923 9.0945 4.5171 6.8101 4.0069 1.2904 2.5233 5.0550 2.3755 3.5541 4.1183 3.9841 1.1930 3.1058 1.4169 4.5236 1.8502 2.7081 3.6673 2.1055 2.2986 2.9055 1.3168 2.1403 1.5635 1.1819 1.1945 2.2357 1.0487 1.0454 1.0647 1.0759 6.7355 8.2468 6.5068 1.0370 1.0375 1.0864 1.0980 1.0958 1.1011 1.1006 1.0777 1.0781
irintensity: 0.7529 0.0397 1.0832 0.4001 9.2676 1.4908 0.0500 1.4548 1.0375 15.6398 2.1898 7.2094 2.6114 2.7806 3.1820 78.0930 3.2993 2.2589 46.3760 127.8774 7.4641 9.9702 3.0556 13.2788 0.7316 16.9143 14.5087 2.1273 73.0923 7.6158 17.4542 101.6592 0.0261 121.6445 10.1485 15.4813 4.5346 44.2549 2.6041 6.5499 7.3259 39.1612 442.1482 417.3927 591.6603 18.3307 25.2655 2.9544 5.3939 60.3213 13.6713 30.2934 53.1832 52.0782
temp: 298.150 k
press: 1.00000 atm
elementType: 8 8 7 7 7 6 6 6 6 6 6 1 1 1 1 1 1 1 1 1
symmnumber: 1
zpe: 408039.4 jmol-1
zpe.correction: 0.155414 hartree
zpe.thermalcorrener: 0.166162 hartree
zpe.thermalcorrenthalpy: 0.167106 hartree
zpe.thermalcorrgfe: 0.117057 hartree
zpe.sumelectzpe: -547.951644 hartree
zpe.sumelectthermal: -547.940896 hartree
zpe.sumelectthermalent: -547.939952 hartree
zpe.sumelectthermalfe: -547.990001 hartree
dipole: -4.9983 2.2624 -0.0094
dipole: 5.4865
quadrupole: -60.5831 -83.7647 -63.4255
quadrupole: 2.2478 -0.0120 -0.0317
quadrupole: 8.6746 -14.5069 5.8323 2.2478 -0.0120 -0.0317
hfenergy: -548.1070583 hartree
pointgroup: C01 [X(C6H9N3O2)]
dipole: -1.9655233 -0.8921871 0.0036477 debye
dipolederiv: -0.6095806 0.2710626 0.0000387 0.2807964 -1.2317396 -0.0002989 -0.0000447 -0.0008915 -0.3759114 -0.9105363 -0.4759897 -0.0019651 -0.3130342 -0.893615 -0.0023427 0.0035921 0.0043524 -0.364086 -1.0242854 0.5969683 -0.0003242 0.1442375 -1.0047462 -0.0000197 0.0000319 0.0005972 -0.2505947 -1.334757 -0.4584388 -0.0004963 -0.2553374 -0.654676 -0.0013427 -0.0021487 0.0000283 -0.2482945 -0.5384836 -0.1395031 -0.001117 -0.103463 -1.3328438 0.0014064 -0.0002737 -0.0020069 -0.3427389 -0.0916174 -0.0100049 -0.0012158 -0.1333762 0.0342833 -0.0002568 -0.003873 -0.000816 0.0705552 1.0108222 0.0604726 0.0027684 0.2865557 1.256285 0.0008192 0.001547 -0.0002089 0.0480529 -0.0454027 -0.0098114 -0.02271 0.0375838 0.0962372 -0.0112678 0.0658842 -0.0259757 -0.0192904 -0.0452487 -0.0096332 0.0228015 0.0381053 0.0962119 0.0131996 -0.063866 0.0275985 -0.0189239 1.4126923 -0.3586542 0.0003965 -0.2302753 1.8133149 0.0010286 0.0003292 0.0009692 0.3213858 1.6485138 0.4540997 0.0020014 0.194592 1.6089805 0.001315 -0.0015879 -0.0016232 0.3375705 0.0706076 -0.0161783 0.0001145 0.0218967 -0.06547 -0.000763 0.000515 -0.0006459 0.0410625 0.093153 0.048499 -0.0177798 0.0142854 -0.1679707 -0.030557 -0.0166205 0.0374135 0.0592032 0.0780371 -0.0483636 0.0937887 -0.0382237 0.0599391 0.0664694 0.0598711 0.0440327 -0.0842365 -0.1657747 0.0449822 -0.0316421 0.041606 0.0822463 -0.0146036 -0.016083 -0.0186109 0.0873262 0.0786846 -0.0469026 -0.0936362 -0.037332 0.061202 -0.064734 -0.0592826 -0.0425851 -0.0869866 0.0931344 0.0485837 0.0185224 0.014166 -0.1686119 0.0276857 0.0170341 -0.0398703 0.0591586 -0.1654425 0.0446938 0.0307983 0.0419135 0.0819023 0.0146152 0.0147928 0.018642 0.0881255 0.2279541 -0.0059888 -0.0004566 -0.0227115 0.1850737 -0.0000253 -0.0003559 0.0000125 0.3323194 0.2175299 0.0101068 0.0001126 0.0180149 0.1439972 -0.0003275 0.0005386 -0.0004118 0.346303 unknown
polarizability: 112.7399315|6.4108614|103.3723611|0.0060483|-0.0450559|58.5606114 unknown
InChI: InChI=1S/C6H9N3O2/c1-3(2)4-7-5(10)9-6(11)8-4/h3,7,9H,1-2H3
charge 0 multiplicity 1
20 atoms
O  1.562292 -2.579268 0.00094
O  2.437667 2.023282 -0.002215
N  -0.202432 -1.027441 0.002419
N  0.176361 1.336163 0.002404
N  2.000436 -0.264897 0.00304
C  -2.149602 0.52526 -0.000173
C  -0.646143 0.298196 0.002086
C  -2.806047 -0.036915 -1.290117
C  -2.814245 -0.052267 1.278684
C  1.167703 -1.388175 0.002047
C  1.5812 1.111685 0.00651
H  -2.262085 1.623026 0.005868
H  -2.73867 -1.140479 -1.344565
H  -2.336229 0.383725 -2.195928
H  -3.877345 0.229674 -1.30327
H  -2.349608 0.356271 2.192682
H  -2.748976 -1.156578 1.319839
H  -3.885368 0.215249 1.288871
H  -0.867535 -1.804109 0.002423
H  3.010227 -0.438404 0.001156
