program: Gaussian 09
title: 000035653
version: EM64L-G09RevD.01
frameworkgroup: C1[X(C17H14ClN3O2)]
method: RPBEPBE
basis: SDD
operation: Freq
keyword: #p
keyword: freq=noraman
keyword: PBEPBE/SDD
title: #p freq=noraman PBEPBE/SDD
converged: YES YES NO NO
title: Mulliken charges:
elementType: Cl O O N N N C C C C C C C C C C C C C C C C C H H H H H H H H H H H H H H
charge: 0.031718 -0.247778 -0.247815 -0.073299 0.067737 0.067698 0.448021 0.448015 0.422958 0.422936 -0.359796 -0.359784 -0.359004 -0.359037 -0.351763 -0.351660 -0.351761 -0.351616 -0.804524 -0.804521 0.054986 0.055003 -0.315852 0.234407 0.234412 0.234374 0.234378 0.249566 0.249483 0.249577 0.249497 0.239675 0.225994 0.226050 0.225995 0.239677 0.226052
chargesum: 0.00000
title: Mulliken charges with hydrogens summed into heavy atoms:
elementType: Cl O O N N N C C C C C C C C C C C C C C C C C
charge: 0.031718 -0.247778 -0.247815 -0.073299 0.067737 0.067698 0.448021 0.448015 0.422958 0.422936 -0.125389 -0.125373 -0.124630 -0.124660 -0.102197 -0.102177 -0.102184 -0.102118 -0.112804 -0.112796 0.054986 0.055003 -0.315852
polarizability: 3.20317021e+02 1.82421825e-03 1.64107529e+02 -6.57166673e-03 -2.27815513e-01 1.68490694e+02
1716.lowfreq: -50.3740 -39.3221 -21.1930 -10.7261 -2.7352 -0.0015 0.0006 0.0018 4.8333
frequency: -50.2165 -39.3071 -21.1610 12.6614 14.1989 29.1359 34.3331 50.6676 119.7842 149.0255 157.8927 167.4742 168.9730 171.5299 230.2645 302.1582 304.6903 310.6721 326.4163 395.1605 405.4913 408.0020 410.6119 411.0158 413.0493 466.5520 492.2880 539.1890 540.0879 615.7290 632.1666 632.4414 632.8341 644.8379 684.7766 704.4359 706.7436 722.4176 753.7080 785.5743 802.0937 810.3300 829.1514 829.8022 833.7437 834.9701 877.9200 910.8403 945.5905 948.2480 966.4753 967.9151 986.8057 986.8237 999.1781 1007.8205 1008.6070 1047.3391 1048.2002 1112.0649 1112.6422 1153.2882 1153.7194 1180.4986 1184.4872 1217.8455 1220.5790 1221.1819 1223.3070 1296.7478 1296.9251 1302.2094 1374.5992 1374.7222 1391.3520 1398.0226 1398.7815 1401.7900 1402.0553 1439.2583 1452.8333 1472.3494 1472.6692 1472.9879 1474.6678 1496.0043 1496.4586 1602.2592 1602.3429 1614.5445 1615.1541 2977.6134 2977.7599 3058.9695 3059.4289 3087.3365 3087.4798 3130.8058 3130.9925 3133.0204 3133.2612 3165.4921 3165.6925 3169.0880 3169.2184
redmass: 1.0319 1.0301 4.3835 4.1906 3.5442 4.6269 7.7387 5.1130 4.2537 10.5654 4.6311 10.8165 13.2394 12.4665 8.1678 3.3647 3.3268 4.7658 4.7886 8.1410 4.2170 4.1925 2.8988 2.9896 15.6824 3.3946 3.0159 7.5994 5.7146 5.5812 6.9829 7.0007 6.1755 12.2356 12.2829 3.3099 3.6562 4.8168 4.5233 12.5109 5.6156 2.7432 1.5386 1.2495 1.2490 2.3488 13.2792 10.9699 1.3486 1.3268 1.3752 1.3728 1.3957 1.3956 10.0405 2.9604 2.9364 1.5593 1.5577 1.2572 1.2573 2.4981 2.2391 1.3063 1.3846 5.7563 3.5007 4.9966 11.2671 1.2701 1.2699 11.7127 6.2965 6.3342 12.4310 1.2212 1.2219 3.1803 3.1733 10.4046 9.0729 1.0937 1.0555 1.0930 1.0537 2.8799 2.7752 7.0619 7.0611 6.4799 6.4573 1.0387 1.0387 1.0951 1.0950 1.0998 1.0998 1.0898 1.0897 1.0896 1.0896 1.0957 1.0957 1.0966 1.0966
irintensity: 0.0000 0.8329 0.0000 0.0000 0.0340 0.0001 0.2017 0.9704 0.1077 0.1742 0.0000 0.0002 1.0386 0.0016 2.9447 0.0011 0.5206 3.3669 5.7612 8.3687 0.0002 6.1970 0.0001 0.8523 6.7045 1.9953 28.1176 5.8252 3.6161 1.0111 0.0001 0.1910 11.8019 1.2654 0.0000 2.1493 0.4314 6.0835 1.1917 11.8793 1.1596 57.2860 0.4281 0.0004 0.9889 54.3717 15.4744 224.4803 0.9175 0.0027 0.0000 0.2396 0.0025 0.1836 51.5061 53.3302 51.7449 39.4254 10.0255 0.0078 26.2951 137.7600 250.6270 81.0074 151.6560 7.9185 19.0216 5.3621 109.8743 0.0001 0.0652 445.5505 0.0314 1.2417 146.5483 1.1041 23.7817 0.0178 1.8306 1170.8993 736.9249 0.0019 37.5892 26.7380 0.4297 13.8346 43.3847 1.1665 4.4754 0.0756 0.0693 6.1858 58.0724 34.8814 4.7215 0.1500 32.4792 0.0593 25.5705 3.2806 29.6439 0.1788 14.2801 0.0496 1.7237
temp: 298.150 k
press: 1.00000 atm
elementType: 17 8 8 7 7 7 6 6 6 6 6 6 6 6 6 6 6 6 6 6 6 6 6 1 1 1 1 1 1 1 1 1 1 1 1 1 1
symmnumber: 1
zpe: 713353.3 jmol-1
zpe.correction: 0.271702 hartree
zpe.thermalcorrener: 0.290206 hartree
zpe.thermalcorrenthalpy: 0.291150 hartree
zpe.thermalcorrgfe: 0.220918 hartree
zpe.sumelectzpe: -1429.332061 hartree
zpe.sumelectthermal: -1429.313557 hartree
zpe.sumelectthermalent: -1429.312613 hartree
zpe.sumelectthermalfe: -1429.382844 hartree
dipole: 7.9016 0.0002 0.0005
dipole: 7.9016
quadrupole: -140.7839 -148.2339 -124.7913
quadrupole: 0.0015 -0.0033 -0.0860
quadrupole: -2.8475 -10.2975 13.1450 0.0015 -0.0033 -0.0860
hfenergy: -1429.6037626 hartree
pointgroup: C01 [X(C17H14Cl1N3O2)]
dipole: -3.1086992 -0.0131288 0.0000498 debye
polarizability: 320.3142577|0.6569353|164.1098822|0.0118505|0.2238962|168.4911036 unknown
InChI: InChI=1S/C17H14ClN3O2/c1-11-3-7-13(8-4-11)22-16-19-15(18)20-17(21-16)23-14-9-5-12(2)6-10-14/h3-10H,1-2H3
charge 0 multiplicity 1
37 atoms
Cl 5.850324 0.026482 0.000523
O  1.449584 2.369724 -0.001027
O  1.469701 -2.354082 0.001255
N  1.351246 0.007377 0.000258
N  3.46019 -1.197842 0.000593
N  3.449881 1.230578 -0.000882
C  -2.796882 2.736695 0.002056
C  -2.773666 -2.756566 -0.002274
C  0.005965 2.421669 0.000039
C  0.026363 -2.418016 0.000041
C  -2.072207 2.660364 1.219963
C  -2.049583 -2.673769 -1.220116
C  -2.074745 2.653138 -1.216928
C  -2.052352 -2.667271 1.216793
C  -0.668662 2.506232 1.229481
C  -0.671253 2.499011 -1.228493
C  -0.64737 -2.507844 -1.229489
C  -0.650192 -2.501347 1.228512
C  -4.302925 2.933655 0.002976
C  -4.277993 -2.966247 -0.003361
C  2.083762 1.154461 -0.000119
C  2.093466 -1.133382 0.000801
C  4.047299 0.018844 -0.000836
H  -2.61041 2.724203 2.172879
H  -2.587146 -2.741851 -2.173099
H  -2.61498 2.71126 -2.169067
H  -2.592124 -2.730209 2.168886
H  -0.108105 2.453889 2.167754
H  -0.112706 2.441046 -2.167631
H  -0.087173 -2.45049 -2.167678
H  -0.092188 -2.438937 2.167683
H  -4.563598 4.009903 -0.004268
H  -4.768995 2.489907 0.900057
H  -4.771737 2.477303 -0.886346
H  -4.747769 -2.526033 -0.900252
H  -4.529526 -4.044665 0.003367
H  -4.750693 -2.51429 0.88615
