program: Gaussian 09
title: 000035629
version: EM64L-G09RevD.01
frameworkgroup: C1[X(C9H2Cl5N3O)]
method: RPBEPBE
basis: SDD
operation: Freq
keyword: #p
keyword: freq=noraman
keyword: PBEPBE/SDD
title: #p freq=noraman PBEPBE/SDD
converged: NO YES NO NO
title: Mulliken charges:
elementType: Cl Cl Cl Cl Cl O N N N C C C C C C C C C H H
charge: 0.011638 0.020090 0.024104 0.065103 0.069778 -0.223636 0.087629 0.029574 0.129730 0.575219 -0.305187 -0.324907 -0.061175 -0.183056 -0.096588 0.097412 -0.230092 -0.265626 0.291411 0.288579
chargesum: 0.00000
title: Mulliken charges with hydrogens summed into heavy atoms:
elementType: Cl Cl Cl Cl Cl O N N N C C C C C C C C C
charge: 0.011638 0.020090 0.024104 0.065103 0.069778 -0.223636 0.087629 0.029574 0.129730 0.575219 -0.305187 -0.033497 -0.061175 0.105524 -0.096588 0.097412 -0.230092 -0.265626
polarizability: 2.60464484e+02 -1.01354080e+01 1.45527983e+02 2.58286968e+01 1.32053398e+00 1.19961647e+02
1716.lowfreq: -2.7729 -2.0077 -0.0029 -0.0028 -0.0025 4.4323 21.9408 23.9709 36.2220
frequency: 21.9125 23.9685 36.2213 72.6947 134.7111 140.4346 155.1935 157.2226 169.4124 180.8585 197.3654 205.8410 234.8435 276.5025 311.9386 334.8018 387.0940 392.6471 432.4406 449.4432 464.0422 510.9085 552.8683 576.6495 625.8674 645.3006 659.2281 660.7131 689.6559 716.1485 787.8571 800.1825 849.3521 859.0907 882.4322 883.6939 949.0118 1035.0485 1107.0143 1182.7258 1193.9395 1208.9124 1228.4195 1236.8724 1329.5505 1346.5352 1364.2070 1420.8619 1435.3123 1458.1910 1568.7405 1582.6855 3182.9382 3184.9967
redmass: 23.7198 22.4541 20.0006 28.3523 16.4945 11.8208 19.5166 17.7535 14.3170 28.5739 12.8057 9.6165 11.9958 15.7350 24.2960 14.9120 20.2969 13.8983 11.5210 3.7352 11.3495 6.7718 11.5899 10.9669 12.3633 8.8207 7.6208 10.6735 4.7383 7.0688 12.7311 12.4088 6.2275 1.6044 10.6785 1.5478 10.6857 7.1510 1.7298 11.6003 9.9244 7.0111 1.2998 8.3096 9.1681 12.4449 10.5597 12.8078 3.7027 7.8924 10.7158 7.9190 1.0928 1.0938
irintensity: 0.0043 0.0112 0.0100 0.0077 0.0272 0.7755 0.0151 0.0105 0.2650 0.1683 0.1143 0.2484 0.1851 1.3061 0.0549 0.1156 9.2723 1.4302 12.1256 8.5022 5.0405 1.0268 40.4296 10.5634 0.0284 9.0455 5.8534 3.2314 3.4383 1.0599 8.1902 151.9719 18.1444 0.5339 0.4449 48.4096 174.2199 149.2806 109.4778 117.6226 250.8675 59.2868 15.0004 82.6497 73.7037 275.4250 32.3333 539.2977 810.2207 434.3907 0.2023 5.1317 4.2400 0.5661
temp: 298.150 k
press: 1.00000 atm
elementType: 17 17 17 17 17 8 7 7 7 6 6 6 6 6 6 6 6 6 1 1
symmnumber: 1
zpe: 254179.5 jmol-1
zpe.correction: 0.096812 hartree
zpe.thermalcorrener: 0.113156 hartree
zpe.thermalcorrenthalpy: 0.114100 hartree
zpe.thermalcorrgfe: 0.049223 hartree
zpe.sumelectzpe: -2882.629198 hartree
zpe.sumelectthermal: -2882.612854 hartree
zpe.sumelectthermalent: -2882.611910 hartree
zpe.sumelectthermalfe: -2882.676787 hartree
dipole: -1.4992 0.2502 0.0782
dipole: 1.5220
quadrupole: -147.3361 -136.0257 -137.2252
quadrupole: -1.4714 -2.1310 6.5851
quadrupole: -7.1404 4.1699 2.9704 -1.4714 -2.1310 6.5851
hfenergy: -2882.7260101 hartree
pointgroup: C01 [X(C9H2Cl5N3O1)]
dipole: -0.5943685 0.0054688 0.072467 debye
dipolederiv: -0.3382856 0.2223585 -0.1795332 0.2190355 -0.241843 0.216417 -0.2145233 0.2393981 -0.2471676 -0.3072335 0.1942784 -0.2270719 0.2666235 -0.2132898 0.2468178 -0.282255 0.2337984 -0.303018 -0.704743 0.1016328 0.1589376 0.1217032 -0.0382119 -0.0104001 0.2441398 -0.0166901 -0.0977598 -0.0892433 0.0427489 0.0439909 -0.0554655 -0.4470943 -0.4159432 -0.0491436 -0.4251641 -0.4580516 -0.8270975 0.2409852 0.2577645 0.253397 -0.1307904 -0.1058468 0.2703562 -0.1059933 -0.1411442 -2.2264144 -0.2382967 -0.1566086 -0.2634972 -0.3510348 -0.0833121 -0.2972794 -0.1015815 -0.3592998 -1.8924616 -0.0371135 0.0205588 -0.1063049 -0.3032982 -0.1856825 -0.06447 -0.1864304 -0.315691 -1.0503618 -0.2599876 -0.2531894 -0.5476302 -0.6535791 -0.5427023 -0.5727162 -0.5794942 -0.6207715 -1.0018855 0.3688527 0.3902133 0.3278615 -0.6852564 -0.6121464 0.3186493 -0.6307135 -0.7217595 1.3950336 0.1430169 -0.1004699 -0.1834697 0.0434572 0.0139847 -0.3770761 -0.0097291 0.0981641 0.2549189 -0.4132812 0.2903976 -0.3046705 0.3123524 -0.334489 0.3399541 -0.3881716 0.3288632 -0.2839806 0.0206432 -0.1014437 0.0723597 -0.1063584 0.0663553 -0.0442557 0.0781922 -0.1140309 0.2104876 -0.3433042 0.469694 -0.3895886 0.2909555 -0.4330569 0.481656 -0.3743452 0.4128998 -0.3211269 0.1108061 0.0017262 0.1156394 -0.106663 0.040283 -0.0104035 0.0739614 -0.0799548 0.9900797 -0.1038441 -0.4120204 -0.1559033 -0.044229 0.0926515 -0.4232687 0.0482607 0.0521878 2.5609361 0.2939902 0.1554614 0.667119 0.719698 0.3926479 0.697392 0.4522836 0.6461108 1.2750559 -0.0887795 -0.0878674 0.1895577 1.0319085 0.9624855 0.193903 0.9837904 1.0689261 2.1624753 -0.291136 -0.3214949 -0.2606139 0.6558025 0.6012813 -0.2941467 0.6141599 0.6980312 0.1125567 0.0251566 0.037948 0.0131311 0.1326423 0.0430102 0.0588506 0.0469693 0.0829186 0.0812899 0.0112732 0.0130072 0.0207163 0.134832 0.0476453 0.0246371 0.047499 0.070547 unknown
polarizability: 258.5338228|-32.382081|122.3648183|-0.9471576|0.759172|145.0554728 unknown
InChI: InChI=1S/C9H2Cl5N3O/c10-3-1-5(12)6(2-4(3)11)18-9-16-7(13)15-8(14)17-9/h1-2H
charge 0 multiplicity 1
20 atoms
Cl -0.368257 -2.089132 1.706377
Cl -4.133049 1.499994 -2.062576
Cl -5.261531 0.322378 0.796828
Cl 2.383633 2.342567 2.275889
Cl 5.339697 -0.769728 -0.947692
O  0.356203 -0.877194 -1.049758
N  2.65582 -0.787669 -0.952096
N  1.321311 0.625977 0.502035
N  3.734982 0.720539 0.609381
C  -0.938228 -0.537439 -0.55129
C  -1.423296 -1.05962 0.666455
C  -1.768879 0.233624 -1.38075
C  -3.091963 0.504625 -0.979628
C  -2.741853 -0.787092 1.071333
C  -3.57588 -0.00234 0.246905
C  1.471156 -0.322087 -0.465594
C  2.49055 1.095996 0.992495
C  3.73479 -0.22296 -0.372185
H  -1.38167 0.612905 -2.329656
H  -3.122538 -1.183145 2.015926
