program: Gaussian 09
title: 000000648
version: EM64L-G09RevD.01
frameworkgroup: C1[X(C5H6N2O4)]
method: RPBEPBE
basis: SDD
operation: Freq
keyword: #pfreq=noraman
keyword: PBEPBE/SDD
title: #p freq=noraman PBEPBE/SDD
converged: YES YES NO NO
title: Mulliken charges:
elementType: O O O O N N C C C C C H H H H H H
charge: -0.414204 -0.214872 -0.246833 -0.196705 -0.345657 -0.383328 -0.181420 -0.485499 0.170018 0.201099 0.172341 0.277326 0.270607 0.280338 0.341809 0.361932 0.393047
chargesum: 0.00000
title: Mulliken charges with hydrogens summed into heavy atoms:
elementType: O O O O N N C C C C C
charge: -0.021157 -0.214872 -0.246833 -0.196705 -0.003847 -0.021396 0.095906 0.065446 0.170018 0.201099 0.172341
polarizability: 8.12219054e+01 -1.01235742e+01 8.73012165e+01 -7.31526765e+00 4.20206093e-01 5.98305371e+01
1716.lowfreq: -7.4145 0.0005 0.0006 0.0007 4.7313 8.7714 36.4572 75.6499 82.6880
frequency: 36.3380 75.6459 82.6830 149.1606 248.4188 313.3299 358.8237 375.9089 437.9045 496.6614 508.8563 552.8093 565.7725 598.0897 601.1887 668.1686 700.4922 755.0218 759.9727 771.2734 910.8444 930.6828 966.5183 1004.3484 1046.7532 1142.0283 1189.4474 1226.4967 1259.3573 1293.6483 1331.0372 1341.4843 1368.4071 1390.8391 1420.2502 1442.1282 1648.0165 1672.9754 1683.3586 3017.5322 3036.2903 3121.7371 3519.9943 3526.1284 3568.5596
redmass: 12.2921 6.7285 8.6522 7.4920 3.2204 4.7248 11.0004 5.9064 3.7998 5.5829 5.0875 2.7726 1.4261 1.6951 2.8631 2.9782 3.1217 2.2752 5.5924 2.4633 3.8739 3.7541 2.5900 2.9234 2.2931 1.7077 1.5025 1.8317 1.7005 2.1655 1.7734 2.0719 1.7733 3.1196 1.5107 1.0965 8.3387 8.4133 5.8171 1.0679 1.0837 1.0958 1.0645 1.0769 1.0775
irintensity: 0.6616 0.6738 1.2446 2.6977 0.5957 4.8745 13.9794 18.7634 15.5116 24.0965 15.9037 6.3279 53.5119 137.0297 42.0376 71.0998 1.9054 79.8710 3.0475 82.6687 4.9371 14.6846 5.7624 72.9875 215.9073 54.2478 55.9175 18.6062 25.1222 109.7626 8.7563 61.1346 5.5904 177.6588 21.5144 18.3601 270.4764 72.6641 650.3715 8.6183 9.4775 0.4505 33.1105 56.6930 50.5832
temp: 298.150 k
press: 1.00000 atm
elementType: 8 8 8 8 7 7 6 6 6 6 6 1 1 1 1 1 1
symmnumber: 1
zpe: 317700.5 jmol-1
zpe.correction: 0.121006 hartree
zpe.thermalcorrener: 0.130734 hartree
zpe.thermalcorrenthalpy: 0.131678 hartree
zpe.thermalcorrgfe: 0.084762 hartree
zpe.sumelectzpe: -603.749854 hartree
zpe.sumelectthermal: -603.740127 hartree
zpe.sumelectthermalent: -603.739182 hartree
zpe.sumelectthermalfe: -603.786098 hartree
dipole: -4.0634 -0.0679 2.9540
dipole: 5.0241
quadrupole: -60.7542 -77.0416 -60.0187
quadrupole: 3.5950 0.7628 -2.8320
quadrupole: 5.1840 -11.1034 5.9195 3.5950 0.7628 -2.8320
hfenergy: -603.8708602 hartree
pointgroup: C01 [X(C5H6N2O4)]
dipole: 1.618019 -0.0838462 1.1323142 debye
dipolederiv: -1.0210425 0.4162563 -0.1536825 0.408851 -0.6606304 0.0345097 0.0048715 -0.0258608 -0.2940696 -0.4820703 -0.1471149 -0.0989183 -0.0356199 -1.1352712 -0.1326897 -0.1256295 -0.2801041 -0.4502026 -0.8797736 0.3262859 -0.1498585 0.3766243 -0.9630957 0.0600097 -0.1766976 0.0561024 -0.4312425 -0.5520299 0.0231508 0.1230666 0.1650303 -0.5818719 0.2144786 0.0421538 0.3735809 -0.6536066 -0.9758862 0.0069778 -0.1411539 0.0208113 -0.3877677 -0.0005827 -0.3643708 -0.0345067 -0.6870914 -0.4636408 0.3239307 0.004075 0.0724242 -1.5462737 -0.1518815 -0.0592291 0.0196816 -0.3712307 0.4092987 -0.1095976 -0.0382959 -0.3415849 0.220783 0.0609234 0.1176536 0.0662362 0.1503495 -0.1087442 -0.0108858 -0.1331734 0.0908381 0.0176985 -0.0794638 -0.1880451 -0.0488699 -0.0890452 0.6622793 -0.333101 0.2833086 -0.1060988 1.6792449 0.1680656 0.3923742 0.0712612 0.4856984 1.4936043 -0.1413762 0.5021081 -0.1908009 1.7276148 0.1810212 0.6016448 0.2586751 0.6614683 1.1344214 -0.4077277 -0.1383095 -0.5037443 0.7833504 -0.3668069 -0.2355794 -0.4940124 0.7787031 -0.0312759 -0.004985 -0.0538579 -0.0068069 0.0787199 -0.0359347 -0.0749359 -0.0303075 -0.0068256 0.0243951 -0.0461031 0.0678831 -0.0645822 0.0806557 -0.003704 0.0495292 0.0235571 -0.0272429 0.0529514 0.0501082 -0.020822 0.0651329 0.0387125 -0.0274128 0.016632 -0.0384117 0.1247394 0.1658636 0.0246198 -0.0768156 0.0361154 0.1789806 -0.0014019 -0.063275 0.0477549 0.3361591 0.2577247 0.0317739 -0.0575517 0.0380681 0.1425338 -0.0118152 -0.051778 -0.0406018 0.2890826 0.3139249 -0.0022123 0.0819977 -0.0246577 0.3266165 0.0926851 0.1146815 0.0758254 0.1843566 unknown
polarizability: 79.8977985|-9.3949742|88.864896|7.0266356|-1.3336296|59.5909645 unknown
InChI: InChI=1S/C5H6N2O4/c8-3-1-2(4(9)10)6-5(11)7-3/h2,6-7,9H,1H2
charge 0 multiplicity 1
17 atoms
O  2.878519 -0.52326 -0.10774
O  -1.159094 -2.540384 -0.50442
O  -2.19207 1.99371 -0.190094
O  1.737608 1.173966 -1.224035
N  -0.229687 1.244542 0.841192
N  -1.5769 -0.254266 -0.402673
C  0.838305 0.248118 0.916283
C  0.229139 -1.175191 1.000866
C  -0.868203 -1.40924 -0.037312
C  -1.373614 1.074504 0.069985
C  1.823906 0.380541 -0.269111
H  1.432854 0.419931 1.832012
H  -0.221816 -1.311775 2.001806
H  1.005684 -1.94298 0.870332
H  -0.033807 2.213001 1.098315
H  -2.371017 -0.369421 -1.040601
H  3.519893 -0.442296 -0.864504
