program: Gaussian 09
title: 000035607
version: EM64L-G09RevD.01
frameworkgroup: C1[X(C5HCl6N3O)]
method: RPBEPBE
basis: SDD
operation: Freq
keyword: #p
keyword: freq=noraman
keyword: PBEPBE/SDD
title: #p freq=noraman PBEPBE/SDD
converged: YES YES NO NO
title: Mulliken charges:
elementType: Cl Cl Cl Cl Cl Cl O N N N C C C C C H
charge: 0.209113 0.117325 0.107287 0.209125 0.117286 0.107307 -0.120812 -0.337814 0.015826 0.015809 0.455132 0.455139 -0.799475 -0.799479 -0.112493 0.360722
chargesum: 0.00000
title: Mulliken charges with hydrogens summed into heavy atoms:
elementType: Cl Cl Cl Cl Cl Cl O N N N C C C C C
charge: 0.209113 0.117325 0.107287 0.209125 0.117286 0.107307 -0.120812 0.022909 0.015826 0.015809 0.455132 0.455139 -0.799475 -0.799479 -0.112493
polarizability: 1.46447588e+02 -3.40009535e-05 1.60917351e+02 -1.03178523e+00 -1.30403616e-03 1.08019364e+02
1716.lowfreq: -41.3634 -6.1974 -0.0020 -0.0014 0.0025 3.3121 9.6334 12.7506 13.3638
frequency: -41.3159 11.6889 13.3505 77.4279 79.6530 112.1632 146.9334 176.3435 204.3733 214.8187 216.6012 219.3212 250.2447 285.4263 292.3189 313.9175 342.0875 372.9297 397.1792 536.5135 547.9136 568.5025 586.5687 632.5718 661.9738 712.8426 729.9896 747.6820 785.6606 789.6367 796.4114 844.9087 922.9000 1017.3107 1032.7978 1213.9047 1259.3338 1397.8366 1541.4445 1591.5502 1649.8894 3496.6619
redmass: 5.7242 24.3098 34.8004 18.6757 27.8472 23.2424 25.8436 33.1970 19.4562 15.9452 21.2189 21.3063 22.1249 22.9640 16.4977 23.6534 21.4256 30.7406 16.5562 11.6532 6.9113 2.6810 13.4430 12.6248 2.1335 13.0775 12.2354 11.3580 11.9333 11.6611 12.6648 11.9621 8.8804 12.2046 9.9558 2.1263 11.8543 3.2234 3.6373 12.5563 12.9905 1.0793
irintensity: 8.4212 0.4293 0.0024 1.1711 0.0403 0.0118 5.3087 0.0942 0.5469 0.3610 1.2020 0.0008 5.1123 0.0024 4.6564 1.8564 4.4177 5.6393 5.5925 4.6147 9.5316 23.3231 0.4311 35.8985 193.3638 67.8973 0.0200 168.1457 70.5641 37.0553 97.0547 45.8314 13.9264 134.5411 14.5530 25.8145 1.2198 256.7208 136.9401 508.1258 122.7044 88.6491
temp: 298.150 k
press: 1.00000 atm
elementType: 17 17 17 17 17 17 8 7 7 7 6 6 6 6 6 1
symmnumber: 1
zpe: 166230.6 jmol-1
zpe.correction: 0.063314 hartree
zpe.thermalcorrener: 0.078209 hartree
zpe.thermalcorrenthalpy: 0.079153 hartree
zpe.thermalcorrgfe: 0.016906 hartree
zpe.sumelectzpe: -3189.818428 hartree
zpe.sumelectthermal: -3189.803534 hartree
zpe.sumelectthermalent: -3189.802590 hartree
zpe.sumelectthermalfe: -3189.864837 hartree
dipole: -0.0001 -5.3316 0.0001
dipole: 5.3316
quadrupole: -128.8157 -146.4502 -124.2241
quadrupole: -0.0007 -0.4038 -0.0005
quadrupole: 4.3477 -13.2869 8.9392 -0.0007 -0.4038 -0.0005
hfenergy: -3189.8817424 hartree
pointgroup: C01 [X(C5H1Cl6N3O1)]
dipole: 0.0001624 2.0976212 -0.000613 debye
dipolederiv: -0.4576416 -0.2582094 -0.090805 -0.2503771 -0.2093293 -0.0586461 -0.0810277 -0.0615527 -0.086939 -0.2251249 0.0464239 0.0162337 0.0881401 -0.2965976 -0.2763957 0.0593738 -0.2513356 -0.6119131 -0.2358057 -0.0491363 0.0699882 -0.0056388 -0.4385129 0.3336249 0.0283677 0.2963207 -0.4687295 -0.4576662 0.2582684 -0.0906242 0.2504277 -0.2093585 0.0585144 -0.0808953 0.0614027 -0.0868551 -0.2251168 -0.0462864 0.0160859 -0.088013 -0.296588 0.276438 0.0592446 0.2513209 -0.6119632 -0.2357529 0.0489822 0.0698685 0.00546 -0.438546 -0.3336514 0.0282642 -0.2963503 -0.4687632 -0.4452887 -0.0000586 -0.0057498 -0.0000474 -1.1466043 0.0003064 -0.0115787 0.0002723 -0.3202218 -1.3958243 -0.0000017 -0.0903359 0.0000492 -0.7591153 0.0002316 -0.1211485 0.0001006 -0.1146438 -0.6586658 0.4088322 -0.0302822 0.2360482 -1.003117 0.0049798 -0.0349568 0.0396288 -0.2121022 -0.6587513 -0.4089124 -0.0300781 -0.2360735 -1.0029852 -0.0044945 -0.0347519 -0.0389653 -0.2120777 0.8641524 0.0983284 0.0489176 0.0534414 0.8018746 0.0203082 0.0223291 0.0474893 -0.0127921 0.8640922 -0.0983137 0.0489764 -0.0534354 0.8018138 -0.0207151 0.0224353 -0.0477723 -0.012746 0.915615 0.2516388 0.0031288 0.3028545 1.013184 0.0003363 0.0159058 -0.01709 1.2916558 0.9156374 -0.2516256 0.0031806 -0.3028644 1.013225 -0.000233 0.0159695 0.0171629 1.2916333 1.0898447 0.0000909 0.0476226 0.0000697 1.910962 -0.0005951 0.0696926 -0.0006425 0.35795 0.3462965 -0.0000207 0.013873 -0.0000412 0.2596948 -0.0000087 0.0427764 0.0000105 0.2785075 unknown
polarizability: 146.1308824|0.0019693|160.9173466|3.6241859|-0.0155822|108.3360748 unknown
InChI: InChI=1S/C5HCl6N3O/c6-4(7,8)1-12-2(5(9,10)11)14-3(15)13-1/h12H
charge 0 multiplicity 1
16 atoms
Cl -3.950245 -0.287742 -0.493987
Cl -2.65003 1.624888 1.461657
Cl -2.273293 2.009138 -1.528632
Cl 3.950398 -0.288075 0.492859
Cl 2.649586 1.624713 -1.462244
Cl 2.273976 2.008896 1.528191
O  -0.000246 -3.42345 0.001076
N  0.000047 0.602748 -0.000137
N  -1.239871 -1.429364 -0.108588
N  1.239699 -1.42948 0.109222
C  -1.190097 -0.122324 -0.101983
C  1.190105 -0.122433 0.101956
C  -2.472576 0.714745 -0.174398
C  2.472685 0.714509 0.17387
C  -0.000153 -2.180501 0.000639
H  0.000115 1.628031 -0.000401
