program: Gaussian 09
title: 000035651
version: EM64L-G09RevD.01
frameworkgroup: C1[X(C15H8Cl3N3O2)]
method: RPBEPBE
basis: SDD
operation: Freq
keyword: #p
keyword: freq=noraman
keyword: PBEPBE/SDD
title: #p freq=noraman PBEPBE/SDD
converged: YES YES NO NO
title: Mulliken charges:
elementType: Cl Cl Cl O O N N N C C C C C C C C C C C C C C C H H H H H H H H
charge: -0.011756 -0.011958 0.042496 -0.233598 -0.233533 -0.072165 0.075697 0.075734 0.527234 0.527018 -0.285559 -0.285184 -0.332225 -0.332450 -0.215444 -0.215524 -0.206133 -0.206089 -0.224276 -0.224329 0.083124 0.083132 -0.315826 0.260019 0.260125 0.258733 0.258721 0.238873 0.238896 0.238114 0.238132
chargesum: 0.00000
title: Mulliken charges with hydrogens summed into heavy atoms:
elementType: Cl Cl Cl O O N N N C C C C C C C C C C C C C C C
charge: -0.011756 -0.011958 0.042496 -0.233598 -0.233533 -0.072165 0.075697 0.075734 0.527234 0.527018 -0.285559 -0.285184 -0.072207 -0.072326 0.043289 0.043197 0.032740 0.032807 0.013838 0.013803 0.083124 0.083132 -0.315826
polarizability: 2.87527870e+02 -8.81909608e-02 1.51538212e+02 1.83954392e+01 -4.10151147e-01 1.88629620e+02
1716.lowfreq: -8.5610 -4.5247 -3.1762 -0.0003 0.0018 0.0027 3.9156 21.9243 29.9253
frequency: 3.8649 21.8896 29.8918 34.0969 41.8947 64.6714 126.5580 137.9938 144.8258 155.9733 174.0336 177.6641 205.4480 241.1769 243.1038 267.9227 273.2761 352.1509 370.8153 422.5084 431.2240 441.1206 448.1205 466.0741 467.0830 495.9479 513.5637 585.5905 594.7980 621.4513 643.2895 645.8735 663.4559 669.9683 681.4751 715.4042 716.1789 759.9466 765.4370 773.7376 788.1866 813.5068 859.8433 861.5466 883.5809 911.6579 943.2366 944.8629 982.5320 983.1617 995.5949 1017.8458 1021.2853 1034.3983 1034.8452 1121.2427 1122.5026 1169.1176 1169.3498 1186.1413 1191.1708 1226.7693 1227.8025 1254.4044 1255.5092 1294.4745 1375.3922 1376.0123 1384.5040 1426.3085 1427.0275 1448.1484 1448.3427 1464.1642 1464.9502 1590.3620 1591.3661 1593.6860 1594.0298 3145.0829 3145.1469 3158.4574 3158.6084 3170.4330 3170.6182 3180.8351 3180.9843
redmass: 8.2196 11.4470 6.2192 11.4812 11.0743 6.2145 5.2748 13.8515 6.1413 13.1116 13.0909 14.2334 8.7221 12.3629 7.6695 5.9517 10.7740 9.6828 9.5037 7.0302 5.8294 4.5769 4.3136 7.6487 7.4527 5.0885 4.7711 8.8409 7.5441 6.2906 6.4229 11.8942 7.0949 6.6574 11.4511 3.5258 3.7409 1.3522 1.3872 6.6588 12.0248 5.8151 1.4563 1.4002 13.5184 10.9310 1.3859 1.3746 1.3435 1.3276 9.9607 5.8203 5.0015 2.4087 2.2977 1.5563 1.5697 1.0963 1.0896 3.1913 3.0282 7.3442 10.1764 1.4444 1.4922 12.3371 11.2316 11.1649 12.3298 2.2928 2.2377 4.2209 4.0429 4.3401 3.9789 6.8483 6.9136 7.4029 7.3295 1.0861 1.0861 1.0906 1.0906 1.0953 1.0953 1.1009 1.1009
irintensity: 0.3236 0.3049 0.1508 0.2432 0.0345 1.5888 0.0039 0.1474 0.3710 0.3247 0.0779 0.7507 0.6722 0.8135 0.7238 0.1479 3.8504 0.9285 5.1323 6.6629 5.0679 0.9789 6.4038 3.0181 11.6732 1.3301 0.6899 7.8221 5.9915 2.7533 0.9313 1.7552 25.7232 2.4007 0.0107 0.3004 11.7512 155.2859 8.8822 10.8168 14.8350 7.8388 1.1379 0.1805 11.3103 206.3878 2.3778 0.1256 0.6600 0.0780 59.0742 21.0550 55.1152 70.4100 43.8299 0.9505 6.9388 5.2349 11.3348 161.6828 335.6299 4.8494 125.2281 9.0706 1.7285 423.4677 12.4013 1.1646 157.5696 140.5487 22.7133 866.5371 476.8428 227.9600 97.4783 0.7034 9.9850 0.0495 1.9964 0.1723 2.8362 2.0078 15.5752 0.3430 9.3208 2.4223 15.2658
temp: 298.150 k
press: 1.00000 atm
elementType: 17 17 17 8 8 7 7 7 6 6 6 6 6 6 6 6 6 6 6 6 6 6 6 1 1 1 1 1 1 1 1
symmnumber: 1
zpe: 522639.7 jmol-1
zpe.correction: 0.199063 hartree
zpe.thermalcorrener: 0.218770 hartree
zpe.thermalcorrenthalpy: 0.219715 hartree
zpe.thermalcorrgfe: 0.145496 hartree
zpe.sumelectzpe: -2269.644624 hartree
zpe.sumelectthermal: -2269.624917 hartree
zpe.sumelectthermalent: -2269.623973 hartree
zpe.sumelectthermalfe: -2269.698192 hartree
dipole: -7.6498 0.0138 -2.9222
dipole: 8.1890
quadrupole: -143.1551 -157.6439 -139.9611
quadrupole: -0.0115 3.3924 -0.0832
quadrupole: 3.7650 -10.7239 6.9589 -0.0115 3.3924 -0.0832
hfenergy: -2269.8436874 hartree
pointgroup: C01 [X(C15H8Cl3N3O2)]
dipole: 3.0235887 -0.018118 -1.1124184 debye
polarizability: 287.9631149|-0.7385495|151.540579|-17.166911|0.4150741|188.1920088 unknown
InChI: InChI=1S/C15H8Cl3N3O2/c16-9-5-1-3-7-11(9)22-14-19-13(18)20-15(21-14)23-12-8-4-2-6-10(12)17/h1-8H
charge 0 multiplicity 1
31 atoms
Cl 0.238493 1.988715 2.481453
Cl 0.222623 -1.973631 2.478952
Cl -5.44446 0.026853 -0.020636
O  -1.050204 2.367996 -0.283308
O  -1.072788 -2.355803 -0.283762
N  -0.956267 0.005584 -0.26133
N  -3.0588 -1.19798 -0.145505
N  -3.04724 1.229076 -0.145948
C  0.379777 2.414643 -0.279323
C  0.356331 -2.41697 -0.279746
C  1.104928 2.313698 0.926197
C  1.083893 -2.316116 0.924321
C  1.039221 2.695506 -1.489966
C  1.011839 -2.712196 -1.489192
C  2.504339 2.471899 0.925097
C  2.48163 -2.488244 0.922885
C  2.441721 2.857922 -1.49635
C  2.412608 -2.888871 -1.495961
C  3.172148 2.743008 -0.291076
C  3.14548 -2.773636 -0.292208
C  -1.687779 1.149762 -0.217899
C  -1.698682 -1.131537 -0.217772
C  -3.647974 0.018433 -0.115132
H  0.446499 2.787596 -2.40493
H  0.417254 -2.80407 -2.402969
H  3.058485 2.390851 1.864755
H  3.037484 -2.406921 1.861502
H  2.957849 3.076102 -2.436398
H  2.925458 -3.118212 -2.435146
H  4.259467 2.869527 -0.290062
H  4.231466 -2.911081 -0.291444
