program: Gaussian 09
title: 000035820
version: EM64L-G09RevD.01
frameworkgroup: C1[X(C19H24N3O3)]
method: RPBEPBE
basis: SDD
operation: Freq
keyword: #p
keyword: freq=noraman
keyword: PBEPBE/SDD
title: #p freq=noraman PBEPBE/SDD
converged: YES YES NO NO
title: Mulliken charges:
elementType: O O O N N N C C C C C C C C C C C C C C C C C C C H H H H H H H H H H H H H H H H H H H H H H H H
charge: -0.305279 -0.286655 -0.307138 -0.131605 -0.310022 -0.379701 -0.396159 -0.367557 0.289031 0.247172 -0.063949 -0.512311 0.531125 -0.298690 -0.299526 -0.523805 -0.641711 -0.201583 -0.183421 0.289298 0.259114 0.023015 -0.526925 -0.496799 -0.528334 0.256401 0.257253 0.226840 0.225551 0.312126 0.281253 0.220087 0.228136 0.373268 0.267178 0.269370 0.271345 0.262024 0.262099 0.264907 0.224404 0.237591 0.257098 0.224428 0.245797 0.230533 0.226674 0.237575 0.260476
chargesum: 1.00000
title: Mulliken charges with hydrogens summed into heavy atoms:
elementType: O O O N N N C C C C C C C C C C C C C C C C C C C
charge: -0.305279 -0.286655 -0.307138 -0.131605 -0.028769 -0.006433 0.117495 0.084833 0.289031 0.247172 0.248177 -0.064088 0.531125 -0.031512 -0.030156 -0.252460 -0.379687 0.060517 0.081486 0.289298 0.259114 0.023015 0.192169 0.203958 0.196391
polarizability: 3.71038780e+02 -8.49051765e+00 2.11006894e+02 -1.15703976e+01 -1.55244431e+01 1.81066879e+02
1716.lowfreq: -11.1156 -0.0004 -0.0002 0.0012 1.3057 2.6723 6.2639 14.2353 21.5202
frequency: -5.1908 14.2131 21.4175 34.1077 44.0169 55.9256 66.1166 76.2797 84.0146 101.6503 105.1034 141.1173 151.6790 158.6473 162.3722 173.3771 203.9467 218.2197 221.9414 229.1462 239.6968 255.4732 282.5193 292.0216 325.0521 350.2024 374.5494 391.2133 418.1955 446.6157 467.8537 474.5007 503.6810 537.1188 552.8479 568.0905 587.7357 589.3470 614.1032 632.8979 634.2945 661.4097 682.0869 729.6269 735.6024 755.1379 757.8867 760.7536 765.9301 789.8996 829.6307 863.8732 864.5045 867.4901 877.1943 882.9972 901.4182 935.6304 958.4887 960.3983 987.0183 1003.6360 1011.9799 1013.8447 1027.7700 1045.0067 1059.9649 1100.3893 1106.3060 1111.7708 1112.6343 1116.5332 1123.4157 1148.3480 1151.4247 1154.8380 1157.1592 1158.5529 1170.4075 1182.3393 1183.9051 1205.7130 1228.2230 1234.5163 1267.7448 1280.3511 1291.5021 1305.7434 1312.8669 1336.2403 1354.2156 1363.3885 1379.4675 1402.7878 1406.9301 1418.3056 1422.5471 1437.8830 1446.2439 1452.5361 1454.1661 1456.6923 1457.8608 1458.9873 1462.4411 1463.4274 1465.5645 1477.3392 1481.0146 1486.9014 1488.7059 1492.1663 1536.1529 1575.3618 1608.1426 1615.0834 1629.4963 2896.4334 2914.9012 2977.5045 2979.1732 2982.9302 2996.2760 3031.2364 3041.1520 3077.3791 3079.3347 3105.3849 3112.8122 3126.8855 3128.1510 3128.8372 3151.5974 3160.8561 3165.7333 3168.6087 3179.0958 3190.0298 3262.7634 3480.0958 3581.9354
redmass: 4.9048 4.7845 4.6234 4.1735 2.3923 4.6638 3.1310 3.1540 3.2068 2.5868 2.4276 1.7377 1.2131 2.7305 1.2120 2.1136 3.3449 4.0798 3.1749 4.0795 3.9714 2.9971 4.2806 4.0792 4.5274 4.8987 5.1403 5.0751 2.9443 5.4395 3.5008 4.9200 5.5436 5.7790 3.8529 3.5083 4.7215 4.6547 2.0954 3.0378 2.4603 3.7939 1.1632 5.0281 4.4128 3.7950 4.1255 3.6893 1.2965 1.4055 1.4587 2.8233 1.3999 2.2144 5.1312 1.5303 5.2169 9.1052 1.3689 2.8120 1.8322 1.3393 2.3283 3.5046 4.0374 4.2554 4.0347 2.1539 1.2782 1.3900 1.2566 1.9063 1.6806 1.3929 1.5904 1.6603 1.5028 1.6548 1.3506 2.0935 1.1806 1.4159 1.4027 2.5407 1.4187 1.5916 1.7990 1.9935 1.9475 1.5844 1.5938 4.7578 1.6179 1.7491 2.9873 1.2899 4.9767 1.3316 1.4332 1.0793 1.3060 1.5976 1.0822 1.2172 1.2002 1.3133 1.7051 1.0691 1.1080 1.0546 1.0924 2.4043 4.3128 7.4191 6.8466 7.0652 7.0797 1.0699 1.0661 1.0306 1.0309 1.0939 1.0303 1.0863 1.0647 1.1042 1.1046 1.1023 1.1065 1.1033 1.1056 1.1032 1.0921 1.0879 1.0914 1.0910 1.0969 1.1009 1.1023 1.0755 1.0833
irintensity: 0.7626 0.3869 1.3768 2.8597 3.8936 4.5694 10.2436 1.0200 1.4405 5.9426 2.7832 2.1462 0.9039 2.0640 0.2209 5.7062 2.6106 11.4096 3.2014 5.7941 6.9105 0.4279 7.1637 18.5008 2.4754 2.3028 6.3225 6.6312 13.6868 5.5650 1.7842 8.5667 0.1319 1.0277 19.8492 2.8118 4.0253 2.3455 47.6468 18.6615 23.1663 35.0166 98.6490 6.1612 1.7732 5.8928 7.4061 6.5574 145.0522 1.3642 3.0390 8.4024 0.4186 23.5186 1.1401 6.2609 49.7929 65.9733 0.9006 19.7951 41.4928 0.0611 25.9697 61.4269 50.0348 138.6242 0.5240 7.0453 2.0288 11.7499 7.3436 11.6224 10.1786 16.3783 40.0807 48.8856 26.9632 36.7621 31.3968 34.6774 0.9828 38.1861 11.1791 11.4042 32.6146 0.3169 5.2135 34.8494 135.3287 107.7134 20.2183 20.6591 12.4192 67.1764 34.6713 7.1441 11.1438 40.1134 19.2849 30.1201 75.4937 44.4642 14.7043 14.2641 34.2142 13.3592 26.3469 4.7862 1.7163 30.2343 12.2811 5.5135 49.1011 95.0556 38.8408 14.5317 7.2469 89.6952 73.0867 81.0780 51.3469 27.8927 67.0960 8.3644 12.6359 25.8375 19.4354 35.1176 4.7926 17.8581 23.3153 17.8777 2.3692 0.3086 2.1060 1.3179 1.7997 0.7080 25.8152 11.9343 195.8498
temp: 298.150 k
press: 1.00000 atm
elementType: 8 8 8 7 7 7 6 6 6 6 6 6 6 6 6 6 6 6 6 6 6 6 6 6 6 1 1 1 1 1 1 1 1 1 1 1 1 1 1 1 1 1 1 1 1 1 1 1 1
symmnumber: 1
zpe: 1056208.8 jmol-1
zpe.correction: 0.402289 hartree
zpe.thermalcorrener: 0.426680 hartree
zpe.thermalcorrenthalpy: 0.427624 hartree
zpe.thermalcorrgfe: 0.345482 hartree
zpe.sumelectzpe: -1126.215383 hartree
zpe.sumelectthermal: -1126.190992 hartree
zpe.sumelectthermalent: -1126.190048 hartree
zpe.sumelectthermalfe: -1126.272190 hartree
dipole: 19.3493 1.9380 -2.4319
dipole: 19.5976
quadrupole: 33.1562 -134.2817 -124.6657
quadrupole: 8.5911 -16.0259 -12.5241
quadrupole: 108.4199 -59.0180 -49.4020 8.5911 -16.0259 -12.5241
hfenergy: -1126.617672 hartree
pointgroup: C01 [X(C19H24N3O3)]
dipole: -7.5383882 -1.3434489 -0.9036534 debye
polarizability: 370.6430055|2.0423458|216.1713389|16.590866|7.9574922|176.2982094 unknown
InChI: InChI=1S/C19H24N3O3/c1-23-17-10-14(11-18(24-2)19(17)25-3)12-20-8-9-22-13-21-15-6-4-5-7-16(15)22/h4-7,10-11,13,20-21H,8-9,12H2,1-3H3
charge 1 multiplicity 1
49 atoms
O  5.19947 2.336349 -0.691434
O  3.909841 -2.03509 1.30622
O  5.947782 0.054254 0.912561
N  -3.969504 -1.075747 -0.169277
N  -0.412503 0.210866 -0.214763
N  -5.846137 -1.748669 -1.153167
C  -2.5261 -0.951071 0.167404
C  -1.815086 0.19212 -0.618036
C  -5.00681 -0.22582 0.298089
C  -6.211976 -0.66084 -0.330605
C  -4.505549 -1.971664 -1.037621
C  0.601803 0.565842 -1.241566
C  2.014256 0.423883 -0.687533
C  -4.996418 0.85028 1.209607
C  -7.451192 -0.037104 -0.082116
C  2.384615 -0.727626 0.040954
C  2.978109 1.426357 -0.943822
C  -6.234382 1.473243 1.460581
C  -7.437362 1.039418 0.826273
C  4.292874 1.282159 -0.453635
C  3.695971 -0.875506 0.554231
C  4.657703 0.156289 0.341714
C  6.435897 1.966124 -1.425034
C  5.24834 -2.664075 1.340448
C  6.223115 1.063494 1.968844
H  -2.022596 -1.905388 -0.056097
H  -2.446531 -0.77836 1.254789
H  -2.360773 1.152136 -0.459125
H  -1.868802 -0.029122 -1.700632
H  -3.951221 -2.75151 -1.552412
H  -0.232271 0.671799 0.684509
H  0.468645 1.599664 -1.634316
H  0.455544 -0.123477 -2.098557
H  -6.477199 -2.296103 -1.740272
H  -4.08167 1.189976 1.702584
H  -8.377735 -0.364957 -0.561513
H  1.662165 -1.52501 0.236843
H  2.738302 2.323841 -1.523301
H  -6.27725 2.312652 2.160773
H  -8.373722 1.557105 1.054105
H  6.178847 1.628318 -2.446325
H  7.029432 2.891024 -1.474427
H  6.990679 1.174238 -0.892358
H  5.70044 -2.682303 0.332909
H  5.922564 -2.132103 2.028677
H  5.059142 -3.689686 1.693906
H  5.529508 0.922362 2.818446
H  7.258629 0.874853 2.289625
H  6.123918 2.085483 1.562653
