program: Gaussian 09
title: 000035591
version: EM64L-G09RevD.01
frameworkgroup: C1[X(C6H7N5S2)]
method: RPBEPBE
basis: SDD
operation: Freq
keyword: #pfreq=noraman
keyword: PBEPBE/SDD
title: #p freq=noraman PBEPBE/SDD
converged: YES YES NO NO
title: Mulliken charges:
elementType: S S N N N N N C C C C C C H H H H H H H
charge: 0.280252 0.283853 0.065139 -0.001670 -0.031600 0.077341 0.002680 -0.335523 -0.350883 0.078338 -0.342482 -0.824551 -0.825465 0.302533 0.280900 0.281027 0.247246 0.284220 0.284010 0.244635
chargesum: 0.00000
title: Mulliken charges with hydrogens summed into heavy atoms:
elementType: S S N N N N N C C C C C C
charge: 0.280252 0.283853 0.065139 -0.001670 -0.031600 0.077341 0.002680 -0.335523 -0.350883 0.078338 -0.039948 -0.015378 -0.012600
polarizability: 2.41933016e+02 -2.28331045e+00 1.59195061e+02 -1.65287192e-02 1.46012456e-02 5.88748103e+01
1716.lowfreq: -0.0020 -0.0018 0.0023 3.3871 8.2185 8.5112 54.8154 68.4810 83.8673
frequency: 54.8142 68.4804 83.8666 91.6413 110.4948 115.0213 125.8810 154.8454 165.0899 184.3214 207.7587 246.9489 286.4975 374.2711 425.2405 453.9554 490.5152 504.9656 575.4086 617.3170 653.9384 658.1429 693.3348 693.4539 800.1886 803.8037 888.5114 925.3286 979.9875 980.7176 994.6301 997.0520 1144.6075 1187.6271 1208.5120 1216.2226 1274.5997 1346.0879 1347.2668 1407.9507 1417.5872 1435.2466 1436.8921 1450.1053 1451.0751 1483.0949 2060.4666 3026.9647 3027.9446 3151.6728 3152.8370 3159.3460 3162.1679 3203.9342
redmass: 4.8524 3.2587 8.8744 3.3664 1.1795 1.1629 4.3381 5.3860 9.3759 4.0998 6.6009 5.5367 5.6495 13.8128 11.3687 12.1335 8.1751 7.5424 1.7110 11.5838 7.3870 7.3663 5.0152 6.1219 13.0105 10.4922 12.7376 5.4615 1.1808 1.1807 1.2721 1.3314 2.5491 11.2691 7.7879 7.9919 2.4286 1.1783 1.1643 7.9962 6.7079 1.0519 1.0519 1.0663 1.0949 7.2460 13.3796 1.0282 1.0283 1.1041 1.1041 1.1058 1.1057 1.0903
irintensity: 0.3187 4.2477 0.8743 1.5766 1.1796 0.0195 2.6137 0.8252 0.6433 0.0923 2.6124 2.5320 6.1803 0.3016 1.6634 0.0056 4.6705 0.0024 36.3034 0.3110 0.6766 0.6459 27.7966 32.1893 108.6957 15.7660 0.9664 11.8358 3.4100 11.5707 2.1643 3.2871 2.0396 135.4889 137.1314 101.4470 93.9393 34.5293 16.1101 677.0784 501.7616 13.4756 17.1600 36.4442 35.5387 648.9619 482.4770 16.3450 17.5633 8.4804 10.1703 9.8401 8.7082 13.4608
temp: 298.150 k
press: 1.00000 atm
elementType: 16 16 7 7 7 7 7 6 6 6 6 6 6 1 1 1 1 1 1 1
symmnumber: 1
zpe: 347865.9 jmol-1
zpe.correction: 0.132495 hartree
zpe.thermalcorrener: 0.146601 hartree
zpe.thermalcorrenthalpy: 0.147545 hartree
zpe.thermalcorrgfe: 0.090220 hartree
zpe.sumelectzpe: -1301.711532 hartree
zpe.sumelectthermal: -1301.697426 hartree
zpe.sumelectthermalent: -1301.696481 hartree
zpe.sumelectthermalfe: -1301.753807 hartree
dipole: 0.9303 0.3130 -0.0021
dipole: 0.9815
quadrupole: -83.4447 -86.4724 -91.3419
quadrupole: -3.0857 -0.0217 -0.0083
quadrupole: 3.6416 0.6139 -4.2556 -3.0857 -0.0217 -0.0083
hfenergy: -1301.8440268 hartree
pointgroup: C01 [X(C6H7N5S2)]
dipole: -0.3292809 0.2003564 0.0235744 debye
dipolederiv: 0.0356345 0.0457511 -0.0008134 0.208963 -0.7554819 -0.0475167 0.0085678 -0.0423296 -0.0710099 -0.7616268 0.2153014 0.0359158 0.3983654 -0.0441566 -0.0124645 0.0453288 -0.0061939 -0.064108 -1.1247085 0.6098586 0.0699231 0.7003778 -1.5240326 -0.1056999 0.0736952 -0.1015912 -0.1183742 -2.088387 -0.0735589 0.0600405 -0.0908837 -0.6185714 -0.0234107 0.0577409 -0.023817 -0.1689265 -0.9030931 -0.5005633 -0.0042089 -0.4620638 -1.4956072 -0.0633773 -0.0011426 -0.062142 -0.1455793 1.9420364 0.0121812 -0.0588937 -1.0406899 -0.0824488 0.0212127 -0.1214841 -0.0138316 0.1569494 -1.2986085 -0.1379585 0.0329495 0.5962785 0.0170173 -0.0150388 0.0773436 0.009405 -0.0664058 0.9802452 -0.08901 -0.036951 -0.2122975 2.0199967 0.1241527 -0.044112 0.1196616 0.0398229 2.1862718 -0.3256515 -0.0912014 -0.474705 1.1100321 0.0792468 -0.0986699 0.0734809 0.0234585 2.0774454 0.3494414 -0.0428234 0.5680555 1.0993859 0.0343843 -0.030501 0.041914 0.1860922 -1.4489916 -0.2107165 0.0260283 0.0101332 -0.0786492 0.012166 0.0396025 0.0198032 -0.3087528 0.1064623 -0.0903618 -0.0080814 -0.0984102 0.0731348 0.0051559 -0.0083797 0.0045696 0.0429247 0.1812612 0.0779997 -0.0005794 0.0639987 0.0197065 -0.0037785 -0.0008878 -0.0042412 0.0381392 0.0779528 -0.0129697 0.0051699 -0.0265624 0.1116789 -0.0072718 0.0045578 -0.0074882 0.2553287 -0.0250764 0.0346703 0.065718 -0.042522 0.0874376 0.0819382 0.0324966 0.0593659 -0.0121492 -0.0317344 0.0377223 -0.0604321 -0.0440028 0.1027386 -0.066041 -0.0364603 -0.0490163 -0.0198127 0.0766039 0.0305165 0.0038267 0.0499885 -0.118571 -0.0160964 0.0049624 -0.0155933 0.1296473 0.0711374 -0.0188407 0.0286275 -0.0943052 0.016062 -0.0839841 0.0222078 -0.0624961 -0.0236895 0.0662423 -0.0110844 -0.0354751 -0.0856304 -0.0007971 0.0925088 -0.037285 0.0661166 -0.0033571 -0.119067 0.0572728 0.0112606 0.0759122 0.0611257 -0.0060856 0.0124191 -0.0055765 0.1298021 unknown
polarizability: 238.633947|-15.4779499|161.8791744|-6.9654789|6.5227797|59.4897659 unknown
InChI: InChI=1S/C6H7N5S2/c1-12-5-9-4(3-8-7)10-6(11-5)13-2/h3H,1-2H3
charge 0 multiplicity 1
20 atoms
S  0.362493 2.975065 0.257895
S  3.225617 -1.611061 -0.103658
N  1.632856 0.617661 0.076383
N  0.543654 -1.555287 -0.011711
N  -0.791639 0.484744 0.150474
N  -3.047804 -1.143325 0.131624
N  -4.107248 -0.632499 0.197937
C  0.381237 1.171265 0.149822
C  1.644857 -0.744177 -0.001539
C  -0.653216 -0.889121 0.065572
C  -1.848169 -1.704801 0.059109
C  -1.489499 3.299683 0.342432
C  4.419859 -0.156344 -0.062537
H  -1.788581 -2.791143 -0.004082
H  -1.912284 2.811771 1.231135
H  -1.976081 2.915112 -0.564189
H  -1.589393 4.394031 0.408738
H  4.289715 0.40448 0.872775
H  4.232437 0.501889 -0.921582
H  5.423689 -0.604945 -0.118996
