program: Gaussian 09
title: 000035631
version: EM64L-G09RevD.01
frameworkgroup: C1[X(C13H7Cl2N3O)]
method: RPBEPBE
basis: SDD
operation: Freq
keyword: #p
keyword: freq=noraman
keyword: PBEPBE/SDD
title: #p freq=noraman PBEPBE/SDD
converged: YES YES NO NO
title: Mulliken charges:
elementType: Cl Cl O N N N C C C C C C C C C C C C C H H H H H H H
charge: 0.049021 0.056253 -0.233935 0.077423 -0.014164 0.126983 0.120709 0.432283 0.227047 -0.448777 -0.354361 -0.417573 -0.314277 -0.236162 -0.229393 -0.235048 0.115489 -0.224784 -0.279547 0.243038 0.279766 0.242097 0.316433 0.234651 0.234468 0.232361
chargesum: 0.00000
title: Mulliken charges with hydrogens summed into heavy atoms:
elementType: Cl Cl O N N N C C C C C C C C C C C C C
charge: 0.049021 0.056253 -0.233935 0.077423 -0.014164 0.126983 0.120709 0.432283 0.227047 -0.205739 -0.074595 -0.175477 0.002156 -0.001512 0.005075 -0.002687 0.115489 -0.224784 -0.279547
polarizability: 3.08175078e+02 4.82869761e+00 2.34859507e+02 -5.09400757e-02 -4.27190697e-01 6.70399184e+01
1716.lowfreq: -7.1402 -1.6165 -0.0019 0.0002 0.0014 6.2808 14.1276 36.6661 69.1161
frequency: 13.6850 36.6544 69.1131 123.4291 143.5745 149.1511 163.8754 176.4907 193.0483 193.7296 248.9172 276.4505 380.7603 403.6821 418.2079 433.2130 440.1159 469.7958 507.0516 520.2321 564.4914 602.4317 621.5016 634.0931 641.0600 657.9596 707.5648 752.9224 781.6225 784.1271 787.8715 802.5186 819.8078 832.4351 880.6064 889.1638 929.3471 932.1571 973.9727 991.7378 1003.2572 1022.3479 1043.3797 1076.3863 1145.7655 1165.4049 1175.4557 1177.4062 1195.3327 1208.0763 1238.7799 1246.8865 1268.9023 1372.8892 1382.9482 1400.4802 1405.3567 1425.3562 1439.6157 1450.2659 1460.5723 1512.8388 1576.9997 1598.2698 1638.2162 3127.9284 3134.8956 3142.3686 3160.1557 3161.3274 3180.6399 3209.8986
redmass: 7.5985 7.4430 8.9470 5.9522 12.0086 10.4565 11.7090 4.6825 8.0728 9.8321 12.5399 5.0545 11.6138 8.4753 3.2470 12.7321 7.5431 3.3303 7.5065 7.7982 3.3949 9.2223 10.6999 3.6752 9.6400 11.8475 7.5070 1.3327 4.6156 5.4223 2.7387 12.6861 1.5205 6.1605 12.8865 1.5836 7.8046 1.3795 1.3653 1.3588 1.3345 3.0629 3.1492 2.2718 1.5833 10.6462 1.0945 1.3953 7.4761 1.9892 1.9300 10.9763 1.6425 2.4613 5.6694 7.4870 4.8417 3.9945 3.5391 2.4950 6.6940 3.7844 7.6176 5.6485 7.0504 1.0864 1.0877 1.0907 1.0968 1.0966 1.0970 1.0940
irintensity: 0.0009 0.1367 0.1101 0.0462 0.1910 1.1839 0.6033 3.3250 0.4049 0.3273 3.3776 0.2985 0.8208 8.6339 5.9217 5.5868 2.5497 0.0005 0.4064 3.1268 12.8405 31.5456 0.0009 0.5436 2.5548 1.2535 5.3798 1.3575 4.5703 0.7530 60.9806 144.1072 97.7518 12.8783 2.6554 3.8300 39.4441 0.5611 0.9021 5.9376 0.0842 70.4657 97.7392 55.4579 37.9977 168.6892 9.0879 123.0644 176.6371 35.1581 6.6301 101.6382 8.7565 328.6798 175.1941 634.2109 28.6243 86.9804 375.0512 93.7179 757.3726 20.4974 2.7735 18.1393 1.8327 0.7495 1.9201 15.3631 28.6345 23.6113 10.1117 11.1851
temp: 298.150 k
press: 1.00000 atm
elementType: 17 17 8 7 7 7 6 6 6 6 6 6 6 6 6 6 6 6 6 1 1 1 1 1 1 1
symmnumber: 1
zpe: 452768.4 jmol-1
zpe.correction: 0.172450 hartree
zpe.thermalcorrener: 0.187507 hartree
zpe.thermalcorrenthalpy: 0.188451 hartree
zpe.thermalcorrgfe: 0.127610 hartree
zpe.sumelectzpe: -1657.861693 hartree
zpe.sumelectthermal: -1657.846636 hartree
zpe.sumelectthermalent: -1657.845692 hartree
zpe.sumelectthermalfe: -1657.906534 hartree
dipole: -3.8281 1.0973 -0.0054
dipole: 3.9823
quadrupole: -116.3161 -116.3623 -124.9942
quadrupole: -0.0418 -0.0084 -0.1948
quadrupole: 2.9081 2.8619 -5.7700 -0.0418 -0.0084 -0.1948
hfenergy: -1658.0341435 hartree
pointgroup: C01 [X(C13H7Cl2N3O1)]
dipole: -1.5514198 0.2050507 0.0757668 debye
dipolederiv: -0.2075518 -0.1952851 -0.0487387 -0.3652929 -0.7903038 -0.1899359 -0.0935225 -0.1921952 -0.0947959 -0.6219558 0.3892259 0.1120558 0.5167847 -0.4607284 -0.1190961 0.1457149 -0.1169493 -0.0741504 -2.6023643 -0.0525836 0.0247868 -0.3547685 -0.3140497 -0.0279671 -0.0454725 -0.0321098 -0.1909258 -2.0953955 0.2314539 0.0926758 0.3642098 -0.5134455 -0.1055919 0.1290855 -0.1035511 -0.163223 -1.5565003 -0.4377316 -0.0911804 -0.9233617 -0.8425809 -0.1755384 -0.2180194 -0.1833694 -0.161669 -0.853621 0.2531811 0.0792413 0.0759774 -1.4673183 -0.3661131 0.0335272 -0.367723 -0.1784742 -0.2469219 0.0446778 0.0147715 0.2347387 0.0791082 0.0163733 0.0623272 0.018667 0.0017065 0.0017778 0.1338268 0.0338911 0.0635946 0.045086 -0.0058157 0.0168346 -0.006797 0.0635541 1.4021647 -0.0292278 -0.0295051 -0.3384911 0.1701889 0.0325179 -0.1117485 0.0270699 0.0697153 0.0555595 -0.1042427 -0.0288224 0.0975735 0.0020595 0.0408841 0.020378 0.0438214 -0.1592614 -0.0100062 -0.0937711 -0.0247495 -0.0614105 -0.0589189 0.0188203 -0.0172319 0.0196124 -0.1271587 0.1173576 -0.0422148 -0.0147109 -0.1016412 -0.0609691 0.0292479 -0.0293486 0.0287018 -0.1665237 -0.1759804 -0.0419894 -0.0094036 -0.0299155 -0.1929074 -0.014436 -0.006441 -0.0132023 -0.1373788 -0.182337 -0.0429832 -0.0104278 -0.1552911 0.1057293 0.06769 -0.037348 0.0667887 -0.1422051 -0.0434089 -0.0370354 -0.0106955 -0.0926235 0.1161452 0.0684394 -0.0240099 0.0678526 -0.1402473 0.1228992 0.0611582 0.011057 0.0800862 -0.0482491 0.0237513 0.0156011 0.023894 -0.1437493 3.1049453 0.1129062 -0.016324 0.797378 0.8099234 0.1281484 0.1536954 0.1379826 0.3111585 1.5421362 0.2249976 0.0350867 0.6031842 1.8453816 0.4537269 0.1353475 0.4587831 0.2005727 2.1167975 -0.4613253 -0.1552841 -0.4317792 1.4675704 0.3757411 -0.1499721 0.3757776 0.1688569 -0.0815649 0.0940012 0.0266906 0.0302302 0.0585107 -0.0251609 0.0111224 -0.0262792 0.1521921 0.0341485 0.0765142 0.0205528 0.0719899 0.0817506 -0.020061 0.0191914 -0.0203326 0.1538348 -0.0718448 0.0386058 0.0128213 0.1098375 0.0437809 -0.0292326 0.0303555 -0.0283093 0.1488666 0.1804347 -0.0302384 -0.0071319 -0.1082437 0.0902454 -0.0190147 -0.0256063 -0.0203938 0.1685368 0.0624746 -0.001242 0.0010403 0.040135 -0.0881272 -0.0615449 0.0112191 -0.0612486 0.1439783 0.082739 0.0130268 0.0043453 -0.0098388 -0.1051287 -0.0646024 -0.0013294 -0.0651402 0.1429107 -0.0739819 -0.1037052 -0.0220424 -0.113062 0.0272468 -0.0312297 -0.0243499 -0.0313505 0.1538792 unknown
polarizability: 305.3546149|15.2381873|227.4955953|-0.0261429|40.3022087|77.2242935 unknown
InChI: InChI=1S/C13H7Cl2N3O/c14-11-16-12(15)18-13(17-11)19-10-7-3-5-8-4-1-2-6-9(8)10/h1-7H
charge 0 multiplicity 1
26 atoms
Cl 3.89064 3.216939 0.787472
Cl 5.198744 -1.816004 -0.555377
O  0.465242 -0.413934 -0.105223
N  2.662225 -0.978144 -0.291348
N  2.072608 1.29844 0.312975
N  4.400089 0.663987 0.109667
C  -1.910585 -0.506277 -0.085667
C  -3.207236 0.115184 0.086173
C  -0.748847 0.322263 0.099812
C  -3.284075 1.505728 0.429112
C  -1.834008 -1.895611 -0.427642
C  -4.384165 -0.684301 -0.093218
C  -0.829324 1.674364 0.434426
C  -2.123478 2.260336 0.598076
C  -3.002122 -2.643922 -0.594072
C  -4.286573 -2.036463 -0.426453
C  1.747239 0.01005 -0.017658
C  3.40162 1.541508 0.355409
C  3.941724 -0.582264 -0.209485
H  -4.26998 1.966644 0.557293
H  -0.850824 -2.355594 -0.55542
H  -5.365143 -0.212508 0.037019
H  0.07395 2.268568 0.567595
H  -2.18592 3.321233 0.860814
H  -2.936559 -3.705444 -0.855657
H  -5.192043 -2.637879 -0.560925
