program: Gaussian 09
title: 000035958
version: EM64L-G09RevD.01
frameworkgroup: C1[X(C23H28ClNO6)]
method: RPBEPBE
basis: SDD
operation: Freq
keyword: #p
keyword: freq=noraman
keyword: PBEPBE/SDD
title: #p freq=noraman PBEPBE/SDD
converged: YES YES NO NO
title: Mulliken charges:
elementType: Cl O O O O O O N C C C C C C C C C C C C C C C C C C C C C C C H H H H H H H H H H H H H H H H H H H H H H H H H H H H
charge: -0.044206 -0.250348 -0.266538 -0.321107 -0.292932 -0.282614 -0.220404 -0.088289 -0.340451 -0.344645 -0.336789 -0.340140 -0.316781 -0.268558 -0.315816 -0.229185 0.081803 0.266110 0.234944 0.395576 -0.520757 -0.555540 -0.006364 0.303845 -0.354714 -0.364974 -0.543117 -0.525892 -0.213506 -0.219218 -0.112470 0.189389 0.209516 0.188138 0.215336 0.172883 0.221947 0.224389 0.206995 0.211711 0.187337 0.224652 0.190768 0.200090 0.217147 0.201905 0.267069 0.281005 0.299520 0.277978 0.273377 0.249819 0.227974 0.230664 0.215383 0.251887 0.235368 0.260870 0.259959
chargesum: 0.00000
title: Mulliken charges with hydrogens summed into heavy atoms:
elementType: Cl O O O O O O N C C C C C C C C C C C C C C C C C C C C C C C
charge: -0.044206 -0.250348 -0.266538 -0.321107 -0.292932 -0.282614 -0.220404 -0.088289 0.058454 0.058829 0.058042 0.091245 0.082267 0.146863 0.101421 0.239789 0.081803 0.266110 0.234944 0.395576 -0.239751 -0.256020 -0.006364 0.303845 -0.076735 -0.091597 0.165340 0.176745 0.047363 0.040741 -0.112470
polarizability: 4.17788161e+02 3.76202356e+01 3.11076813e+02 4.16198608e+00 1.39040726e+01 1.97387898e+02
1716.lowfreq: -4.9360 -1.0269 -0.0020 -0.0018 -0.0015 3.4969 11.3906 12.8906 15.2924
frequency: 10.4011 12.4390 14.6156 19.9111 37.2813 39.9440 44.1799 58.7969 67.1944 68.4990 74.8819 88.6139 91.2561 104.4921 129.2812 150.4562 153.0250 160.6043 170.4779 194.0858 197.1453 214.3372 222.6654 245.6414 251.4427 265.1773 271.4109 280.9088 287.3298 298.4797 302.2611 307.2901 332.4033 346.2856 382.4249 385.5836 390.5494 411.0508 413.6729 439.0116 457.3599 467.9957 471.5495 502.1757 523.0747 532.9985 546.9874 576.2623 582.9656 595.4516 612.5425 624.1089 696.6252 703.0935 722.4437 733.2617 755.2578 759.7552 763.3226 802.4661 805.9903 835.1031 843.6171 849.0145 865.0892 868.6259 872.9814 897.7412 908.4101 911.8002 931.4825 942.7409 969.9561 980.3676 991.8786 1000.0009 1009.8785 1019.9139 1021.1149 1028.6558 1046.6991 1052.1120 1065.9882 1072.0033 1073.5589 1090.3692 1103.0338 1106.3064 1108.8252 1109.0576 1110.7746 1116.4664 1142.6264 1152.7754 1158.3662 1161.2081 1182.8666 1184.9623 1189.5688 1202.8795 1219.4746 1222.2969 1246.0640 1249.5107 1267.2673 1271.9128 1293.3372 1293.8694 1295.4285 1309.9954 1326.9928 1341.3752 1345.1335 1355.6246 1361.0806 1366.8866 1372.3555 1376.1922 1378.2273 1386.8921 1394.3139 1401.9989 1435.1292 1440.9432 1442.0528 1442.8601 1444.1781 1448.6353 1449.0258 1454.3810 1456.9370 1463.3794 1465.5524 1468.7287 1471.9187 1476.8821 1478.8685 1481.9724 1531.9775 1567.7978 1578.9917 1591.3361 1597.2968 2846.5124 2847.8577 2863.9642 2947.8629 2950.8601 2959.3293 2966.9914 2972.1112 2974.9228 2992.4051 3028.6572 3030.0454 3035.5658 3047.1756 3056.4479 3057.8990 3077.3982 3080.2915 3080.5031 3096.6053 3126.0035 3129.2111 3149.8073 3154.8641 3170.7623 3172.6862 3176.2386 3177.4112
redmass: 3.5674 5.9224 5.9604 6.8649 5.0317 5.1209 5.0360 3.7821 2.7998 3.2967 4.8079 5.0447 3.1603 4.7070 2.7429 3.9403 3.0032 2.1067 6.9024 3.0514 5.9766 3.4012 2.1002 2.1816 3.7485 2.3846 3.9057 3.8184 2.9157 3.1491 5.3015 2.7672 2.1977 5.2037 4.6038 6.4204 1.9797 3.5335 3.6396 3.7977 5.6407 3.6041 2.8347 5.2691 4.8122 3.1686 5.2289 5.0461 1.9772 4.8481 5.2436 6.7571 4.9025 6.1671 3.9088 2.9006 3.4284 4.0181 3.2154 4.0015 5.9761 1.2974 1.5974 1.6569 1.7617 5.4252 2.7724 2.4307 2.0565 1.9841 2.2211 6.8867 1.3534 1.3833 2.2239 4.4260 2.7055 2.7859 2.8878 2.1329 2.5804 2.0839 5.9953 2.7827 2.8074 3.0556 3.2195 2.3230 1.4243 1.2650 1.2658 2.4575 2.4245 1.4292 1.4522 2.1645 1.4390 1.5064 1.0655 1.3508 1.1779 1.7647 1.1670 2.4667 1.2360 1.2222 1.4187 1.2741 1.2288 5.2819 1.2978 1.3681 1.2682 1.3539 1.4235 5.3108 1.2665 4.0470 1.3262 1.4327 3.9467 2.9059 1.3307 1.2485 1.0979 1.0893 1.0897 1.3254 1.0957 1.1320 1.0994 1.1618 1.4631 1.0546 2.0535 1.1981 1.2490 1.0608 10.7285 7.5333 7.6618 6.2500 6.9119 1.0703 1.0707 1.0691 1.0645 1.0664 1.0654 1.0329 1.0632 1.0341 1.0635 1.0900 1.0909 1.0886 1.0928 1.0971 1.1042 1.0974 1.0985 1.0989 1.1013 1.1036 1.1002 1.0886 1.0888 1.0922 1.0941 1.0972 1.0925
irintensity: 0.5986 0.2142 0.3757 0.6057 0.1823 0.9722 0.1639 2.1801 2.9912 0.7498 2.4936 6.5069 1.8672 10.2063 3.3904 0.6116 2.5729 6.1517 1.4825 3.2969 5.2916 4.5140 2.2534 0.5950 4.6187 6.0389 6.3640 1.0518 2.8156 9.2565 4.4163 14.1032 2.1974 1.5901 5.9463 9.0947 0.7025 9.9273 3.0018 14.2331 15.0617 10.8387 1.3844 9.9282 6.7396 5.4422 13.3120 4.0608 4.2623 2.0811 18.5048 2.0783 6.1689 5.0047 4.6695 10.3390 6.0397 45.7171 17.4715 14.5654 107.6831 4.6364 0.1647 30.1781 6.8047 19.3127 27.1952 35.2771 54.4733 24.1536 27.0521 55.0360 0.6339 7.4391 5.5445 42.8534 12.6981 8.0951 12.8200 13.3329 45.8303 16.2286 242.2236 28.7672 41.9989 13.9956 139.6603 6.1117 11.8990 10.8607 0.7551 64.7082 48.7940 10.4825 28.2233 9.8680 66.0221 3.9131 4.9168 56.1957 9.1411 21.4389 1.5906 61.6461 33.5748 3.3378 21.1669 10.9774 0.4326 756.5456 6.4494 1.8222 11.8994 10.6720 3.9548 21.9663 1.0491 21.8870 4.2487 1.1750 21.7057 75.3076 37.2117 4.9073 19.8382 3.7144 2.6955 68.1400 4.3602 40.0998 16.9310 27.8348 26.2997 18.7523 13.7510 15.2335 12.1715 18.3939 220.1779 49.6106 19.4199 106.9903 24.6737 31.4488 51.6940 236.3740 77.0914 70.7551 75.0438 37.9371 61.3915 87.8378 34.4777 16.0632 27.7622 30.8628 45.0150 30.8225 44.8348 41.6549 28.3634 45.1929 14.2524 20.3142 19.5540 5.0232 0.0830 2.9295 3.1664 3.0633 2.6921
temp: 298.150 k
press: 1.00000 atm
elementType: 17 8 8 8 8 8 8 7 6 6 6 6 6 6 6 6 6 6 6 6 6 6 6 6 6 6 6 6 6 6 6 1 1 1 1 1 1 1 1 1 1 1 1 1 1 1 1 1 1 1 1 1 1 1 1 1 1 1 1
symmnumber: 1
zpe: 1236851.8 jmol-1
zpe.correction: 0.471092 hartree
zpe.thermalcorrener: 0.502552 hartree
zpe.thermalcorrenthalpy: 0.503496 hartree
zpe.thermalcorrgfe: 0.402918 hartree
zpe.sumelectzpe: -1856.965531 hartree
zpe.sumelectthermal: -1856.934071 hartree
zpe.sumelectthermalent: -1856.933127 hartree
zpe.sumelectthermalfe: -1857.033705 hartree
dipole: -2.9617 1.7500 0.7465
dipole: 3.5202
quadrupole: -196.3586 -211.3794 -178.7683
quadrupole: 10.1019 9.7600 6.5283
quadrupole: -0.8565 -15.8773 16.7338 10.1019 9.7600 6.5283
hfenergy: -1857.4366229 hartree
pointgroup: C01 [X(C23H28Cl1N1O6)]
dipole: -1.2235163 -0.5619998 -0.3243633 debye
polarizability: 404.8660215|-49.8256007|324.0344588|18.4553862|-3.1931546|197.3523917 unknown
InChI: InChI=1S/C23H28ClNO6/c1-27-20-15-18(22(26)17-3-5-19(24)6-4-17)16-21(28-2)23(20)31-14-13-30-12-9-25-7-10-29-11-8-25/h3-6,15-16H,7-14H2,1-2H3
charge 0 multiplicity 1
59 atoms
Cl 6.95761 -3.826804 1.143933
O  -3.531724 -3.676912 0.822099
O  -4.960555 1.381071 -1.540935
O  -1.906214 1.706988 -0.627315
O  -0.595553 -0.680511 -1.332941
O  -0.417842 3.856765 0.457089
O  4.431598 2.417854 0.177729
N  -4.802274 -1.140303 0.207025
C  -3.849755 -1.262837 1.33708
C  -5.507666 -2.424383 -0.017759
C  -5.709226 0.022007 0.324833
C  -2.846816 -2.392589 1.0541
C  -4.482062 -3.536107 -0.294589
C  -5.037273 1.342743 -0.069454
C  -3.83017 2.126406 -2.090725
C  -2.486286 1.40149 -1.975283
C  -0.528409 1.5476 -0.442246
C  0.182204 0.353616 -0.784075
C  0.191229 2.62784 0.152707
C  2.280336 1.353159 0.006455
C  1.572555 0.259806 -0.562395
C  1.581247 2.531088 0.357659
C  3.768424 1.332494 0.190074
C  4.494426 0.028468 0.395251
C  5.848859 -0.056308 -0.025533
C  3.913368 -1.077623 1.071832
C  0.095715 -1.911362 -1.735631
C  -1.542532 3.83787 1.415413
C  6.602543 -1.226579 0.188543
C  4.661073 -2.251194 1.311344
C  5.992051 -2.310249 0.854092
H  -4.383867 -1.473249 2.299869
H  -3.29009 -0.316296 1.453924
H  -6.132787 -2.72029 0.863747
H  -6.176293 -2.317908 -0.892581
H  -6.127006 0.123055 1.359996
H  -6.565843 -0.130198 -0.357707
H  -2.240109 -2.119511 0.165369
H  -2.187877 -2.566213 1.921446
H  -4.97191 -4.519467 -0.390524
H  -3.928107 -3.297625 -1.228805
H  -4.028304 1.421532 0.375646
H  -5.651661 2.199695 0.282979
H  -3.745403 3.142044 -1.647568
H  -4.075248 2.23101 -3.163507
H  -1.780314 1.772267 -2.744462
H  -2.618673 0.312025 -2.07556
H  2.117146 -0.639635 -0.859125
H  2.122942 3.386442 0.770084
H  6.299797 0.813971 -0.51298
H  2.887405 -1.012425 1.447541
H  -0.694858 -2.565534 -2.130982
H  0.582857 -2.399089 -0.869616
H  0.846181 -1.709695 -2.523444
H  -1.207295 3.436897 2.391573
H  -2.383981 3.241037 1.026156
H  -1.836957 4.892248 1.527797
H  7.641135 -1.296626 -0.146674
H  4.22214 -3.096568 1.848832
