program: Gaussian 09
title: 000035574
version: EM64L-G09RevD.01
frameworkgroup: C1[X(C7H8Cl3N3O)]
method: RPBEPBE
basis: SDD
operation: Freq
keyword: #p
keyword: freq=noraman
keyword: PBEPBE/SDD
title: #p freq=noraman PBEPBE/SDD
converged: NO YES NO NO
title: Mulliken charges:
elementType: Cl Cl Cl O N N N C C C C C C C H H H H H H H H
charge: 0.110715 0.127367 0.110916 -0.191202 -0.049373 0.013973 0.002439 0.277953 0.034457 0.050964 -0.231179 -0.757117 -0.738944 -0.673053 0.236184 0.236485 0.251772 0.252359 0.249509 0.214967 0.235426 0.235382
chargesum: 0.00000
title: Mulliken charges with hydrogens summed into heavy atoms:
elementType: Cl Cl Cl O N N N C C C C C C C
charge: 0.110715 0.127367 0.110916 -0.191202 -0.049373 0.013973 0.002439 0.277953 0.034457 0.050964 0.241489 -0.757117 0.014696 0.012722
polarizability: 1.54257203e+02 1.51099673e+01 1.48362780e+02 -5.20166180e-02 -7.51099773e-01 9.35086623e+01
1716.lowfreq: -27.2995 -14.4635 -5.9755 -0.0006 0.0020 0.0027 2.5470 8.1003 49.9057
frequency: -27.2057 -11.7511 49.8912 82.2371 87.0794 97.2926 146.9552 173.9442 199.0785 209.5156 218.6929 221.7183 248.8389 283.6343 292.5117 329.5132 362.2283 380.9606 503.8177 555.6192 594.8127 630.7336 650.1124 724.6763 751.6041 753.2458 800.7223 824.2415 828.0126 902.5789 964.4920 984.8722 1017.5163 1051.3459 1073.6584 1112.7915 1133.1112 1191.7075 1254.4690 1287.3360 1314.6592 1351.0387 1392.1283 1401.9846 1418.8033 1429.5123 1450.7414 1461.7244 1466.1535 1468.7818 1483.4085 1494.9977 2997.5960 3000.4086 3019.6407 3081.6623 3089.9655 3097.1881 3115.3536 3140.4311
redmass: 1.0138 11.0940 2.4402 7.6048 5.2401 2.5125 7.2497 7.4991 2.5231 7.3504 19.7586 9.4248 1.5860 6.1988 19.5133 3.4717 6.6306 17.8176 4.8723 6.1584 4.9505 8.3274 7.2677 8.6006 9.7122 10.6789 1.1044 9.4707 4.4876 13.6304 2.7227 4.4017 2.7115 1.6771 3.1410 2.3094 1.4554 8.5384 1.1312 5.3467 4.0522 1.9793 1.3452 1.2805 3.8788 2.2586 1.3264 1.0394 1.3386 1.1781 1.2551 2.8830 1.0420 1.0361 1.0582 1.1067 1.0897 1.0983 1.1033 1.1025
irintensity: 0.4066 0.0008 0.0453 2.0863 1.2570 4.1199 2.8291 0.9132 0.0106 0.2384 0.0678 0.3618 0.7583 2.3803 0.4513 3.0269 1.8668 0.0713 10.5090 12.9383 39.5416 18.6066 40.1184 85.6074 86.4347 97.8072 2.4914 2.3642 56.9108 9.4083 5.5962 12.7818 55.9758 13.9722 54.0910 2.1368 5.8869 15.3783 0.0895 179.6924 256.4579 9.7464 90.0054 24.5568 121.9759 258.6084 141.1839 13.0727 51.8182 34.8733 40.3968 319.4873 0.9003 19.1375 12.2220 3.4490 8.2247 22.6040 37.2093 4.5526
temp: 298.150 k
press: 1.00000 atm
elementType: 17 17 17 8 7 7 7 6 6 6 6 6 6 6 1 1 1 1 1 1 1 1
symmnumber: 1
zpe: 386703.3 jmol-1
zpe.correction: 0.147288 hartree
zpe.thermalcorrener: 0.160818 hartree
zpe.thermalcorrenthalpy: 0.161762 hartree
zpe.thermalcorrgfe: 0.105865 hartree
zpe.sumelectzpe: -1890.123370 hartree
zpe.sumelectthermal: -1890.109840 hartree
zpe.sumelectthermalent: -1890.108895 hartree
zpe.sumelectthermalfe: -1890.164793 hartree
dipole: -2.4485 -0.3661 -0.0871
dipole: 2.4773
quadrupole: -104.5391 -94.1894 -100.4945
quadrupole: 9.8415 0.0335 -0.3299
quadrupole: -4.7981 5.5516 -0.7535 9.8415 0.0335 -0.3299
hfenergy: -1890.2706574 hartree
pointgroup: C01 [X(C7H8Cl3N3O1)]
dipole: 0.9740298 0.0111494 -0.0327681 debye
dipolederiv: -0.3774266 0.0132143 0.3025244 0.0087919 -0.1713004 0.0657302 0.2692291 0.0753155 -0.584319 -0.1949972 -0.192201 0.0033579 -0.2043065 -0.6371978 0.0082815 0.0035891 0.0079754 -0.1330521 -0.3833303 0.0036753 -0.3041349 -0.0000805 -0.1739787 -0.0766332 -0.2710467 -0.0859827 -0.5715391 -1.6885684 -0.711589 0.0008962 -0.6601707 -0.6849643 0.0001282 0.0004016 0.0003095 -0.2972746 -1.3324478 -0.1686694 -0.0002524 0.3605469 -0.4448264 -0.0000534 -0.0029227 0.0045156 -0.1401344 -0.627863 0.2184823 0.0062836 0.2692543 -1.2789485 -0.002358 -0.0013354 0.0074786 -0.1085789 -0.9848734 -0.311202 -0.0111969 -0.5910033 -0.8780467 -0.0027249 0.0038025 0.0009753 -0.2082193 0.8866151 -0.1338495 -0.0002423 -0.275636 0.751095 0.0011093 0.0009376 -0.0124311 -0.0428599 2.1902705 0.6854091 0.0012363 0.3545061 0.6844905 0.0041065 -0.0063697 -0.0074217 0.2861638 0.8674736 0.0758271 0.0086137 0.1093671 1.3207431 0.0272226 0.0189832 0.0703742 0.0857128 0.6860203 0.3013355 -0.0000726 0.640026 0.6808261 -0.0002059 -0.0022925 -0.0008299 0.3187027 0.8613426 0.3109596 -0.001001 0.2409283 1.0516407 0.001713 0.0015241 0.0006992 1.3158748 0.0036444 -0.0806257 -0.0049744 -0.1058266 -0.4306711 -0.0316544 -0.0463421 -0.1796859 -0.0163061 -0.1464641 -0.0547621 -0.0005786 -0.0819664 0.026503 0.0000254 -0.0003044 0.0000208 0.0597142 -0.0005695 0.0253833 -0.0800725 -0.0882621 -0.0292676 0.0331492 -0.0802205 0.0616359 -0.0467162 -0.001601 0.026521 0.0798585 -0.0871611 -0.0300138 -0.0336746 0.081321 -0.0613733 -0.044066 0.0119708 0.0598973 -0.0794834 0.0276461 0.0550297 0.0388043 -0.049616 0.0967913 0.08099 -0.0289732 -0.0304583 0.0776874 0.0180053 0.090727 -0.00536 0.0796688 0.0542406 0.0909888 0.1258615 -0.0195751 0.0009335 -0.012877 0.0695705 -0.0277906 0.0008283 -0.032435 -0.0538927 0.035234 -0.0538331 -0.000005 -0.0932138 -0.1269667 0.0010047 0.0002345 0.0011849 0.1193119 0.0498586 0.0174847 -0.0459471 0.0849296 0.0787048 0.0896483 -0.0793243 0.077864 -0.0566412 0.048823 0.0185758 0.0465697 0.0865025 0.0768516 -0.0904683 0.0792545 -0.0792211 -0.0538595 unknown
polarizability: 158.231895|13.750019|144.3915904|0.2133635|0.6037804|93.5051605 unknown
InChI: InChI=1S/C7H8Cl3N3O/c1-3-14-6-12-4(2)11-5(13-6)7(8,9)10/h3H2,1-2H3
charge 0 multiplicity 1
22 atoms
Cl -3.111086 0.929802 1.523601
Cl -1.434637 2.893914 -0.032247
Cl -3.131382 0.889236 -1.512032
O  2.599984 -0.112801 0.006009
N  0.341512 0.557862 0.000782
N  -1.338555 -1.182048 0.012985
N  1.010347 -1.783698 0.017386
C  -0.940173 0.116961 0.002406
C  1.281072 -0.445206 0.005803
C  -0.317742 -2.107788 0.019349
C  2.952286 1.35017 -0.000166
C  -2.067405 1.160253 -0.00469
C  -0.68774 -3.561974 0.008611
C  4.473802 1.413707 0.005311
H  2.503939 1.807562 -0.899565
H  2.496975 1.817057 0.89077
H  0.073347 -4.155474 0.538022
H  -1.683197 -3.70817 0.454251
H  -0.728265 -3.927442 -1.035518
H  4.797927 2.470209 0.000627
H  4.886727 0.926742 0.90456
H  4.893565 0.916726 -0.885256
