program: Gaussian 09
title: 000035616
version: EM64L-G09RevD.01
frameworkgroup: C1[X(C15H9Cl2N3O)]
method: RPBEPBE
basis: SDD
operation: Freq
keyword: #p
keyword: freq=noraman
keyword: PBEPBE/SDD
title: #p freq=noraman PBEPBE/SDD
converged: YES YES NO NO
title: Mulliken charges:
elementType: Cl Cl O N N N C C C C C C C C C C C C C C C H H H H H H H H H
charge: -0.030207 -0.030207 -0.160030 -0.466155 -0.060759 -0.060766 0.153138 0.153146 0.322693 0.322693 -0.322721 -0.322717 -0.348983 -0.348970 -0.211680 -0.211684 -0.219314 -0.219316 -0.135093 -0.104098 -0.104098 0.330788 0.298918 0.298922 0.209875 0.209865 0.266489 0.266489 0.261891 0.261892
chargesum: 0.00000
title: Mulliken charges with hydrogens summed into heavy atoms:
elementType: Cl Cl O N N N C C C C C C C C C C C C C C C
charge: -0.030207 -0.030207 -0.160030 -0.135368 -0.060759 -0.060766 0.153138 0.153146 0.322693 0.322693 -0.023803 -0.023795 -0.139108 -0.139106 0.054808 0.054806 0.042578 0.042576 -0.135093 -0.104098 -0.104098
polarizability: 3.55404331e+02 -4.36035722e-04 2.49384710e+02 1.77884363e-03 -5.82079284e+00 7.75170765e+01
1716.lowfreq: -5.6204 -0.6348 -0.0026 -0.0025 -0.0021 6.1299 28.3783 32.6247 38.1699
frequency: 28.3672 32.6189 38.1698 54.5261 60.1340 100.5539 117.5387 141.8780 171.1103 190.9124 233.0220 250.1725 279.7120 304.1246 307.8804 380.1094 393.5120 407.0134 407.5609 462.8609 466.2504 481.0612 490.9360 556.3707 606.1223 618.2580 625.1637 631.8424 655.6334 669.2212 679.5078 711.8058 731.0684 736.4339 778.4384 808.4827 818.0414 820.0746 831.9940 854.7549 856.6693 944.7263 946.4215 976.4955 977.3827 993.0218 993.4147 998.8864 1001.8364 1061.9426 1074.9918 1080.5165 1111.0202 1119.0086 1161.5318 1188.4263 1190.3099 1257.9622 1296.9333 1296.9374 1329.1617 1356.4298 1372.7662 1376.5969 1400.6717 1406.1928 1470.4084 1482.3372 1545.6155 1551.8226 1582.1673 1585.4839 1600.6060 1601.2246 1627.0328 3123.1665 3123.3270 3162.6808 3162.7035 3174.4167 3174.4366 3180.3507 3180.3920 3558.2743
redmass: 4.8460 3.6966 11.4263 8.6632 10.5374 7.3844 9.8860 8.1195 10.1544 11.0735 12.6481 9.4676 8.0886 6.9590 6.8500 4.9888 7.2949 2.8771 2.9000 8.7120 8.8338 3.4752 3.3179 10.0166 7.4731 1.9501 6.9270 2.2454 5.6227 8.1460 5.0366 6.5379 3.4624 4.1270 6.3590 3.6704 1.7612 1.4567 8.3363 1.4522 1.5489 1.3926 1.3876 6.8342 8.1513 1.4782 1.4163 3.2115 3.4666 7.1501 2.7938 2.4629 1.3704 1.3736 2.8620 1.2051 1.1254 2.0953 1.2583 1.3053 4.4244 3.7351 5.5381 6.5386 4.1464 3.7216 2.3731 2.6381 3.6973 10.0370 6.3643 8.2241 6.0555 6.7095 11.9710 1.0895 1.0896 1.0893 1.0893 1.0952 1.0952 1.0976 1.0976 1.0778
irintensity: 0.5015 0.0007 0.6538 5.8578 0.1812 6.1354 7.2696 0.7707 0.5126 1.6101 0.0393 1.0681 5.2493 0.1590 0.1988 0.2113 13.1351 0.1896 0.3857 10.0393 17.7288 0.0838 45.2786 0.6959 0.8328 41.4461 0.6828 23.7995 6.6655 6.9133 15.6074 16.2251 0.1360 11.5097 64.5792 43.3825 1.0343 25.9996 10.5579 0.0682 72.5538 3.1502 0.0791 99.4335 7.6225 35.5815 3.8242 95.9785 10.8549 4.8022 96.4357 22.3178 55.6168 11.8119 68.6116 52.9732 3.3667 160.6361 0.1662 7.9077 22.7972 88.9392 9.3416 86.3566 0.7318 113.8921 227.3416 33.6787 405.6109 432.4955 29.0132 309.0277 181.3229 7.8290 68.1373 34.1545 2.6658 0.0089 1.4749 1.0197 2.9061 4.0624 1.5208 20.3754
temp: 298.150 k
press: 1.00000 atm
elementType: 17 17 8 7 7 7 6 6 6 6 6 6 6 6 6 6 6 6 6 6 6 1 1 1 1 1 1 1 1 1
symmnumber: 1
zpe: 541848.2 jmol-1
zpe.correction: 0.206379 hartree
zpe.thermalcorrener: 0.223829 hartree
zpe.thermalcorrenthalpy: 0.224773 hartree
zpe.thermalcorrgfe: 0.157954 hartree
zpe.sumelectzpe: -1735.164459 hartree
zpe.sumelectthermal: -1735.147009 hartree
zpe.sumelectthermalent: -1735.146065 hartree
zpe.sumelectthermalfe: -1735.212884 hartree
dipole: 0.0000 -7.3916 -0.7718
dipole: 7.4318
quadrupole: -136.3242 -158.7492 -137.5275
quadrupole: 0.0001 0.0005 -3.8247
quadrupole: 7.8761 -14.5489 6.6728 0.0001 0.0005 -3.8247
hfenergy: -1735.370838 hartree
pointgroup: C01 [X(C15H9Cl2N3O1)]
dipole: -0.0007403 -2.9238855 0.0014631 debye
polarizability: 355.4043223|-0.0293646|246.3053005|-0.0210692|-23.5297854|80.5964948 unknown
InChI: InChI=1S/C15H9Cl2N3O/c16-11-5-1-9(2-6-11)13-18-14(20-15(21)19-13)10-3-7-12(17)8-4-10/h1-8,18H
charge 0 multiplicity 1
30 atoms
Cl -6.504568 -2.258321 0.136254
Cl 6.50298 -2.261618 0.13545
O  0.000781 4.067296 -0.458359
N  -0.000228 0.088208 -0.214355
N  -1.236013 2.115148 -0.056171
N  1.236617 2.114511 -0.056329
C  -1.211555 0.792055 -0.098911
C  1.211476 0.791428 -0.099064
C  -2.474373 0.014604 -0.027974
C  2.473908 0.013339 -0.028287
C  -3.694209 0.695669 -0.285145
C  3.694067 0.693814 -0.285496
C  -2.508643 -1.368102 0.297519
C  2.507514 -1.369414 0.29708
C  -4.923654 0.012537 -0.235652
C  4.923175 0.010064 -0.236151
C  -3.733893 -2.064564 0.350535
C  3.732418 -2.066494 0.349941
C  0.000481 2.839465 -0.212568
C  -4.924981 -1.363083 0.076588
C  4.923836 -1.365585 0.075967
H  -0.000504 -0.916241 -0.391061
H  -3.649544 1.763957 -0.51685
H  3.649911 1.762142 -0.517116
H  -1.595325 -1.917281 0.556812
H  1.593944 -1.918172 0.55638
H  -5.862291 0.535752 -0.437595
H  5.862057 0.532828 -0.438119
H  -3.764712 -3.126087 0.610535
H  3.762725 -3.128055 0.609841
