program: Gaussian 09
title: 000035571
version: EM64L-G09RevD.01
frameworkgroup: C1[X(C6H8BrN3O2)]
method: RPBEPBE
basis: SDD
operation: Freq
keyword: #p
keyword: freq=noraman
keyword: PBEPBE/SDD
title: #p freq=noraman PBEPBE/SDD
converged: NO NO NO NO
title: Mulliken charges:
elementType: Br O O N N N C C C C C C H H H H H H H H
charge: 0.000287 -0.198439 -0.198439 -0.080328 -0.080338 0.029151 0.159694 0.040674 0.040675 -0.766509 -0.502631 -0.502631 0.301525 0.301527 0.240599 0.239732 0.247560 0.240597 0.247563 0.239731
chargesum: 0.00000
title: Mulliken charges with hydrogens summed into heavy atoms:
elementType: Br O O N N N C C C C C C
charge: 0.000287 -0.198439 -0.198439 -0.080328 -0.080338 0.029151 0.159694 0.040674 0.040675 -0.163457 0.225260 0.225261
polarizability: 1.24166236e+02 -1.46795317e-03 1.37458431e+02 1.76241238e+00 -5.93007966e-04 7.16750634e+01
1716.lowfreq: -3.5588 0.0002 0.0007 0.0007 4.0904 7.2400 28.5144 70.4846 81.7613
frequency: 28.4864 70.4829 81.7608 122.5656 133.6689 148.3848 179.1231 195.8694 207.6086 220.6033 242.3009 347.9666 378.5216 512.6759 524.3013 565.3623 620.4686 622.7946 709.1561 718.1968 812.2973 835.7108 893.4817 906.4689 945.9864 1006.2675 1055.4156 1114.0680 1114.7162 1118.4475 1142.6606 1157.4949 1230.8138 1238.8223 1310.3257 1335.6427 1377.4018 1418.7223 1439.2181 1447.5761 1452.5819 1452.6922 1458.1629 1461.4772 1473.4860 1502.4768 3010.0206 3010.2099 3088.2825 3114.9200 3114.9697 3155.6105 3155.7369 3186.5804
redmass: 6.0910 10.7612 3.0972 1.2749 1.1012 3.0448 3.6506 4.8830 2.5868 10.2455 7.0041 2.8071 4.7473 7.6443 10.0318 7.8341 5.5798 4.5853 12.1347 8.7358 11.3231 3.8430 13.4180 2.0896 9.2970 5.3682 4.8514 1.2519 1.2519 1.3467 1.5643 1.4879 1.1635 5.5972 4.2447 7.1304 2.1301 1.4584 1.3466 3.3595 1.0500 1.0509 1.0844 1.0653 2.1333 5.4390 1.0292 1.0293 1.0558 1.1048 1.1048 1.1052 1.1052 1.1126
irintensity: 1.2556 0.8336 12.2130 0.0111 0.2895 0.0004 6.8872 0.0010 0.4214 0.3895 7.2405 19.3079 0.7920 3.3488 2.5024 4.8316 42.4649 20.3802 0.0066 16.4387 12.5275 5.4739 9.0980 1.8666 5.1438 1.2410 110.9467 0.1570 0.0838 0.0054 2.5932 0.2534 11.8098 285.9086 427.7281 1.6911 193.9817 29.0080 0.3201 264.6238 0.0286 31.2558 151.9053 6.5157 23.6087 666.3483 68.5413 2.2807 6.8986 45.7930 0.2538 17.6176 22.5539 0.1920
temp: 298.150 k
press: 1.00000 atm
elementType: 35 8 8 7 7 7 6 6 6 6 6 6 1 1 1 1 1 1 1 1
symmnumber: 1
zpe: 377834.8 jmol-1
zpe.correction: 0.143910 hartree
zpe.thermalcorrener: 0.156326 hartree
zpe.thermalcorrenthalpy: 0.157270 hartree
zpe.thermalcorrgfe: 0.102868 hartree
zpe.sumelectzpe: -560.666502 hartree
zpe.sumelectthermal: -560.654086 hartree
zpe.sumelectthermalent: -560.653142 hartree
zpe.sumelectthermalfe: -560.707543 hartree
dipole: -1.2455 -0.0002 2.2557
dipole: 2.5767
quadrupole: -96.5988 -59.1975 -76.2617
quadrupole: -0.0017 1.9787 0.0005
quadrupole: -19.2461 18.1552 1.0910 -0.0017 1.9787 0.0005
hfenergy: -560.8104116 hartree
pointgroup: C01 [X(C6H8Br1N3O2)]
dipole: 0.0001802 -0.6141208 -0.8065851 debye
dipolederiv: -0.1014647 0.0001623 -0.0000545 0.0001539 -0.4270068 0.096935 -0.0001057 0.2426751 -0.2602449 -1.6770241 0.3482643 0.0140472 0.5465934 -0.499374 -0.0047531 0.1242739 -0.0397673 -0.3176508 -1.6762854 -0.3493023 -0.013918 -0.5475561 -0.5002027 -0.0047137 -0.1241262 -0.0398421 -0.3176407 -0.8790701 -0.2019879 0.0179059 -0.5399194 -1.0763899 -0.0870964 -0.1151401 -0.1944301 -0.1588993 -0.879651 0.2020473 -0.0177844 0.5400675 -1.0757231 -0.0871469 0.1153393 -0.1943296 -0.1589137 -1.6098546 -0.0004792 0.0000541 -0.0004817 -0.4222641 -0.005777 0.0000637 -0.0303891 -0.2275598 0.9796738 -0.0000389 -0.0000181 -0.0000167 1.0376354 -0.0132542 -0.0000694 0.1132944 -0.046202 2.0312385 -0.3948347 -0.0143091 -0.7334047 1.0263142 0.0870234 -0.161259 0.1580178 0.2739372 2.0303257 0.3957807 0.0140879 0.734217 1.0274125 0.0869483 0.1609811 0.1581078 0.2739091 0.0811453 -0.0000657 0.000111 -0.000099 0.2347049 -0.19634 0.0001214 -0.2570442 0.3895694 0.8652092 -0.0792564 0.0123585 0.1638323 0.2107242 -0.0000349 0.0335999 -0.0055927 0.262436 0.8652722 0.0797897 -0.0124189 -0.1632953 0.2106158 -0.0000168 -0.0336513 -0.0057445 0.2624627 0.0249845 0.0521463 0.0719187 -0.0130449 0.0396622 0.0611138 0.0602966 0.0390005 -0.0151361 0.0249952 -0.0521512 -0.0719742 0.0130569 0.039647 0.0610597 -0.0603306 0.038936 -0.0151079 0.0031326 0.0022172 0.0217829 -0.1087071 0.0856867 -0.0695064 -0.0507757 -0.05991 -0.0887943 -0.0513213 0.0815948 0.0170524 0.138141 -0.0068816 -0.0295025 0.033767 -0.0323475 0.12026 0.0084338 0.0166242 -0.0231822 -0.1131787 0.0082987 0.1020517 -0.0059757 0.1007462 -0.0039362 0.0030375 -0.0023296 -0.0217291 0.1086316 0.0858598 -0.0695406 0.0508233 -0.0597451 -0.0888275 0.0083656 -0.0165974 0.0230934 0.1131883 0.0083242 0.1020651 0.0058932 0.1007549 -0.0039258 -0.0511427 -0.0815837 -0.0170237 -0.1381783 -0.0070435 -0.0295145 -0.0337256 -0.0323905 0.1202645 unknown
polarizability: 137.4584291|0.0052147|122.5430097|0.0024996|-9.2561531|73.2982916 unknown
InChI: InChI=1S/C6H8BrN3O2/c1-11-5-8-4(3-7)9-6(10-5)12-2/h3H2,1-2H3
charge 0 multiplicity 1
20 atoms
Br 0.00161 -3.64892 0.978032
O  -2.298414 1.558411 0.177671
O  2.297086 1.560309 0.177529
N  1.212264 -0.483175 -0.28848
N  -1.211928 -0.484163 -0.288461
N  -0.000672 1.579926 0.185636
C  0.000419 -1.099826 -0.417182
C  -1.139713 0.854843 0.016029
C  1.138956 0.855774 0.016005
C  0.000994 -2.563398 -0.744099
C  -3.574121 0.815212 0.030259
C  3.573395 0.818174 0.029956
H  0.918125 -2.862764 -1.266608
H  -0.916007 -2.863495 -1.266413
H  -3.661774 0.399446 -0.986876
H  -4.344819 1.574412 0.220156
H  -3.627234 -0.005489 0.764148
H  3.66129 0.402539 -0.987211
H  3.627259 -0.002521 0.763796
H  4.343483 1.578004 0.219814
