program: Gaussian 09
title: 000035578
version: EM64L-G09RevD.01
frameworkgroup: C1[X(C6H3Cl6N3O)]
method: RPBEPBE
basis: SDD
operation: Freq
keyword: #p
keyword: freq=noraman
keyword: PBEPBE/SDD
title: #p freq=noraman PBEPBE/SDD
converged: NO YES NO NO
title: Mulliken charges:
elementType: Cl Cl Cl Cl Cl Cl O N N N C C C C C C H H H
charge: 0.122778 0.154801 0.123114 0.127968 0.136841 0.128455 -0.182607 0.094278 -0.038162 0.050103 0.251258 0.294842 -0.772459 -0.772224 0.026573 -0.497217 0.251885 0.251889 0.247881
chargesum: 0.00000
title: Mulliken charges with hydrogens summed into heavy atoms:
elementType: Cl Cl Cl Cl Cl Cl O N N N C C C C C C
charge: 0.122778 0.154801 0.123114 0.127968 0.136841 0.128455 -0.182607 0.094278 -0.038162 0.050103 0.251258 0.294842 -0.772459 -0.772224 0.026573 0.254439
polarizability: 1.61283211e+02 -8.45267523e+00 1.71528362e+02 1.73877585e-02 2.79055544e-03 1.16028441e+02
1716.lowfreq: -12.5357 -11.7357 -6.8315 -0.0032 -0.0023 -0.0016 6.0100 7.0526 57.5625
frequency: -11.7213 -7.7476 57.5579 79.4927 88.4160 118.8641 124.4967 127.4056 160.3398 179.3602 201.0195 208.0029 220.2419 229.4498 251.9698 260.3835 279.7493 311.0174 311.3861 363.6949 379.2144 414.1481 511.4840 594.3740 607.5494 649.5974 656.6032 727.4280 746.4462 768.9661 775.2872 779.9255 839.5475 895.0666 905.6289 1002.7039 1039.8318 1113.2445 1146.2701 1195.3180 1289.6050 1304.5264 1375.4716 1433.8643 1450.5576 1452.8541 1460.4830 1485.2126 3015.9038 3123.7772 3166.8199
redmass: 34.6588 12.9154 14.1270 25.3974 5.0223 3.5186 1.3666 6.1110 12.6726 33.1056 9.0420 15.7773 14.2028 13.6179 25.9525 6.9178 23.4238 20.0688 21.3518 14.2272 27.6210 12.3778 10.0570 7.7027 13.4905 13.0677 12.9329 11.3742 12.2595 12.1855 12.1583 11.5154 12.5972 12.0908 11.8688 10.0926 8.7689 1.2533 1.7086 5.5500 9.7760 11.6397 2.5929 9.7389 1.6423 1.0494 1.3693 4.2649 1.0292 1.1052 1.1058
irintensity: 0.0005 0.0321 0.0108 0.0577 3.8510 2.6660 0.2531 2.3328 3.0104 0.0322 0.7988 1.6005 0.1673 1.3839 0.5864 5.4495 0.0266 2.8661 1.3950 2.2497 0.0424 1.7867 7.3833 8.6233 0.3418 153.7750 98.7354 176.6481 156.6068 0.8139 31.7189 66.1107 2.8701 47.3851 33.0270 43.8434 11.3111 0.0429 5.7905 34.8380 178.3096 5.6034 183.3238 245.3910 41.6951 18.1399 73.6249 505.2504 22.8803 15.7529 14.9000
temp: 298.150 k
press: 1.00000 atm
elementType: 17 17 17 17 17 17 8 7 7 7 6 6 6 6 6 6 1 1 1
symmnumber: 1
zpe: 238538.7 jmol-1
zpe.correction: 0.090855 hartree
zpe.thermalcorrener: 0.106290 hartree
zpe.thermalcorrenthalpy: 0.107235 hartree
zpe.thermalcorrgfe: 0.046786 hartree
zpe.sumelectzpe: -3229.028869 hartree
zpe.sumelectthermal: -3229.013433 hartree
zpe.sumelectthermalent: -3229.012489 hartree
zpe.sumelectthermalfe: -3229.072937 hartree
dipole: -2.4365 3.4029 -0.0010
dipole: 4.1853
quadrupole: -138.2136 -123.8763 -130.0254
quadrupole: -10.8068 0.0104 -0.0016
quadrupole: -7.5085 6.8288 0.6797 -10.8068 0.0104 -0.0016
hfenergy: -3229.1197232 hartree
pointgroup: C01 [X(C6H3Cl6N3O1)]
dipole: -1.0752767 1.2470365 -0.0006603 debye
dipolederiv: -0.2318091 0.0611953 0.0625585 0.0720319 -0.2987684 -0.2922723 0.0256974 -0.2527317 -0.550356 -0.383421 -0.3158611 -0.0017033 -0.2795738 -0.4012672 -0.0016809 -0.0013057 -0.0016828 -0.1099561 -0.2304219 0.0608491 -0.0615883 0.071333 -0.3028211 0.2943457 -0.0243065 0.2545986 -0.5456222 -0.1796063 -0.0243668 -0.0391235 -0.0362921 -0.3274899 0.2910394 -0.057968 0.2457662 -0.5454505 -0.5825252 0.2503641 -0.0025002 0.2287678 -0.2282612 0.0012086 -0.0020725 0.0012867 -0.1222283 -0.1789492 -0.0220052 0.0411305 -0.0335779 -0.3306464 -0.2928098 0.0603667 -0.2470955 -0.5401371 -0.524418 0.3995939 -0.0000313 0.6068517 -1.6061115 0.0000602 -0.0000914 0.000012 -0.2978821 -1.4397926 -0.2203698 -0.0002453 -0.1563248 -0.4940296 -0.0001353 -0.0019038 -0.000465 -0.0647052 -0.4714593 -0.4097681 -0.0003794 0.1545605 -1.2336606 0.0001204 0.0000609 -0.0010907 -0.1548594 -0.7368954 0.5976125 -0.0001325 0.2594606 -0.9788345 -0.000381 -0.0003283 0.000554 -0.1786518 1.0869669 -0.1606046 -0.0000655 -0.1552089 0.7155598 0.000301 -0.0009021 0.0009848 -0.0279061 0.9184537 0.3062079 -0.0000217 0.135904 0.8392242 -0.0001223 -0.0010124 -0.0011259 -0.0207362 0.8149294 0.2702158 0.0010772 0.3225863 1.0587666 -0.0003903 0.0018918 -0.0008685 1.2630722 1.0106767 -0.2800695 0.0008832 -0.3231244 0.8254609 0.0007694 0.0015378 0.0015757 1.2605754 0.5376672 -0.2281338 0.0000169 -0.6155506 2.1756185 0.000083 0.0001732 0.0004696 0.3236167 0.5184556 -0.4404072 0.0000693 -0.2195886 0.5584121 -0.0000723 0.0001358 -0.0003035 0.246281 -0.005835 0.0934971 0.0455684 -0.0298292 0.072428 0.0797522 0.0647986 0.0508922 -0.0333124 -0.0056356 0.0935983 -0.0454712 -0.0296707 0.0725284 -0.0797855 -0.064741 -0.0506791 -0.0335208 0.0836189 -0.031548 -0.0000421 0.0272451 -0.1161078 -0.00003 -0.0000307 -0.0000969 0.1317788 unknown
polarizability: 162.8826779|-9.234534|169.928862|0.0392765|0.0127225|116.0284747 unknown
InChI: InChI=1S/C6H3Cl6N3O/c1-16-4-14-2(5(7,8)9)13-3(15-4)6(10,11)12/h1H3
charge 0 multiplicity 1
19 atoms
Cl 2.889481 -1.569286 -1.521192
Cl 3.938489 0.810575 0.008317
Cl 2.886309 -1.581639 1.515816
Cl -2.013839 -2.47138 1.521431
Cl -3.827615 -0.609008 -0.009499
Cl -2.005209 -2.482866 -1.515429
O  -0.447386 3.115192 0.000806
N  0.237381 -0.899917 -0.000149
N  -1.332205 0.933063 -0.000925
N  1.061017 1.377143 0.001725
C  1.234392 0.03646 0.001563
C  -1.020445 -0.38787 -0.001373
C  2.666587 -0.517057 0.001511
C  -2.16549 -1.411076 -0.001671
C  -0.251116 1.774173 0.000579
C  -1.852306 3.606911 -0.000362
H  -2.379659 3.249379 0.89869
H  -2.37804 3.249762 -0.900512
H  -1.746744 4.699438 -0.000025
