program: Gaussian 09
title: 000035837
version: EM64L-G09RevD.01
frameworkgroup: C1[X(C32H18)]
method: RPBEPBE
basis: SDD
operation: Freq
keyword: #p
keyword: freq=noraman
keyword: PBEPBE/SDD
title: #p freq=noraman PBEPBE/SDD
converged: YES YES NO NO
title: Mulliken charges:
elementType: C C C C C C C C C C C C C C C C C C C C C C C C C C C C C C C C H H H H H H H H H H H H H H H H H H
charge: -0.109503 -0.107867 0.030955 0.030252 0.384510 0.384487 0.195887 0.195328 0.151702 0.151710 0.215502 0.215690 -0.837289 -0.837592 0.525907 0.526317 -0.432572 -0.432887 -0.353779 -0.353732 -0.412815 -0.413209 -0.496967 -0.497010 -0.277528 -0.277922 -0.284701 -0.284701 -0.260502 -0.260859 -0.252783 -0.252761 0.233338 0.233344 0.289656 0.289871 0.231127 0.231125 0.286301 0.286531 0.248549 0.248559 0.232458 0.232469 0.231658 0.231657 0.229752 0.229767 0.231287 0.231281
chargesum: 0.00000
title: Mulliken charges with hydrogens summed into heavy atoms:
elementType: C C C C C C C C C C C C C C C C C C C C C C C C C C C C C C C C
charge: -0.109503 -0.107867 0.030955 0.030252 0.384510 0.384487 0.195887 0.195328 0.151702 0.151710 0.215502 0.215690 -0.603950 -0.604248 0.525907 0.526317 -0.142916 -0.143015 -0.122652 -0.122607 -0.126514 -0.126678 -0.248418 -0.248451 -0.045070 -0.045453 -0.053043 -0.053043 -0.030750 -0.031092 -0.021496 -0.021480
polarizability: 5.84419825e+02 1.47770464e-02 4.93131131e+02 -2.75392730e-02 3.89851302e+00 1.63237901e+02
1716.lowfreq: -9.7455 -6.4796 -6.0155 -0.0004 0.0003 0.0005 32.7592 59.2745 64.0483
frequency: 32.7544 59.2711 64.0461 85.1442 100.6616 121.3281 132.9371 134.2443 185.2579 188.8432 225.0228 236.4354 269.9750 278.4023 299.4810 305.7524 314.6907 326.3701 361.9696 362.3001 378.8150 423.0564 433.6077 449.2829 459.5062 482.7057 494.7873 512.8790 539.7686 549.6582 553.1172 554.3370 563.9275 583.4980 613.5312 614.5785 622.8996 626.5704 638.3826 656.4419 665.4401 680.3451 696.4917 726.0286 744.8426 757.7058 763.7145 765.6068 772.3969 781.3714 786.3157 797.6503 805.0000 826.9110 832.9428 861.6047 864.5829 865.8330 873.0035 888.7906 901.3808 906.1873 918.5188 953.0240 955.2940 957.8670 962.7353 971.1824 977.5998 983.4396 986.0900 989.4127 1004.0900 1008.4547 1031.9650 1033.8776 1054.3967 1059.2963 1064.0116 1105.5520 1122.2779 1127.0824 1140.1562 1170.8223 1175.5667 1176.3814 1184.0842 1185.1897 1199.2026 1223.0549 1225.1604 1252.4657 1257.1443 1282.5877 1293.6892 1296.1370 1314.4614 1326.9298 1337.9493 1363.0187 1374.0719 1384.5011 1385.3495 1391.3691 1412.5310 1413.2313 1419.9737 1423.7620 1429.2291 1438.8271 1452.5018 1469.3479 1475.8542 1482.9613 1503.0093 1505.7272 1534.3699 1566.2274 1572.1506 1576.6278 1595.8760 1599.6864 1607.8097 1612.9773 1618.9477 1627.7897 3121.1456 3121.2299 3129.7427 3130.0333 3134.4782 3134.5573 3140.2409 3143.3204 3147.9527 3149.7736 3154.3840 3155.3536 3160.5277 3165.1467 3168.1534 3170.5989 3173.3345 3177.4949
redmass: 5.4323 4.1932 5.5898 3.8967 4.4334 4.4828 5.0817 4.6315 5.5686 5.0237 4.8175 4.6428 4.5544 5.6701 4.6823 5.0723 5.7961 6.0677 6.3230 5.1000 5.1477 3.4846 5.4122 4.0588 3.5942 3.6582 3.4455 6.7695 3.2781 4.1905 3.4181 5.6710 6.7081 7.2009 5.2589 5.7431 3.6795 5.4457 6.5238 6.3214 5.5235 6.5660 3.1267 4.4132 3.4672 1.8894 1.3967 1.4998 2.0329 1.7883 4.0531 4.6086 2.6640 1.8956 5.7391 1.5028 4.7841 1.3975 5.8388 1.4268 1.6104 6.8191 1.8899 2.6306 1.4139 1.4107 6.3842 1.6044 2.2165 2.0256 1.3515 1.3422 1.3651 1.3363 2.4824 2.1945 2.1870 2.1157 3.3528 3.1425 2.1610 1.9154 1.6181 1.7369 1.3657 1.0988 1.1222 1.1549 1.8103 1.4686 1.7251 1.6730 1.8393 1.7099 1.6320 2.8678 2.3864 4.8349 1.9481 2.7822 9.0781 7.7929 2.8314 5.2228 3.3548 4.1406 4.7608 3.4978 3.0616 2.7815 3.2981 3.1903 2.8767 2.7404 3.2567 3.9406 5.1564 8.4556 7.6089 5.8715 6.7944 5.6369 5.8451 5.8369 6.1004 6.8753 1.0867 1.0867 1.0851 1.0858 1.0893 1.0893 1.0902 1.0915 1.0913 1.0896 1.0949 1.0953 1.0919 1.0969 1.0991 1.0989 1.0949 1.0969
irintensity: 0.0015 0.0084 1.8378 0.1515 0.3032 0.1118 0.7920 0.2308 0.0932 0.2037 0.0981 0.0004 1.8257 0.8780 0.7991 0.0543 0.0124 0.3070 0.1741 1.8203 0.2318 1.4696 0.2282 0.4689 8.4872 5.6583 0.2872 1.1904 18.2150 0.1689 0.0364 0.0252 5.2091 6.0576 7.6572 9.0231 4.3812 1.6379 4.1418 0.8561 0.0081 0.0008 49.2725 1.4355 0.0513 50.9656 32.9782 5.8360 72.5360 29.2981 0.5902 0.3078 57.1834 4.0926 0.0518 1.1500 0.2777 9.2650 1.4459 3.3104 0.2304 2.8467 38.4617 0.7307 0.0857 11.5797 0.8095 0.5467 1.5176 1.6205 0.5368 0.0642 2.1546 2.2872 6.9555 3.7852 15.5963 2.7264 5.0329 0.1998 1.6199 4.6899 5.3758 0.4923 0.4376 0.9885 1.3740 1.2764 0.0423 0.8693 4.3184 2.0878 8.6631 13.4201 0.5000 0.6442 11.0191 3.5694 1.2704 7.1182 0.2742 2.8613 5.7887 0.5008 3.5342 2.7781 1.7099 11.1507 0.9972 4.4486 3.0445 3.6541 4.1901 7.5794 36.7309 12.0532 4.1217 0.6751 0.2759 2.5542 2.0634 0.9019 0.8917 0.0188 0.0238 3.9876 1.7879 3.5349 0.0002 1.9291 12.6729 0.9599 25.7809 0.5228 29.1943 0.0208 64.5811 0.9265 30.1316 9.1712 16.0534 42.7543 31.7378 25.4498
temp: 298.150 k
press: 1.00000 atm
elementType: 6 6 6 6 6 6 6 6 6 6 6 6 6 6 6 6 6 6 6 6 6 6 6 6 6 6 6 6 6 6 6 6 1 1 1 1 1 1 1 1 1 1 1 1 1 1 1 1 1 1
symmnumber: 1
zpe: 1020550.6 jmol-1
zpe.correction: 0.388707 hartree
zpe.thermalcorrener: 0.409967 hartree
zpe.thermalcorrenthalpy: 0.410912 hartree
zpe.thermalcorrgfe: 0.339975 hartree
zpe.sumelectzpe: -1228.230075 hartree
zpe.sumelectthermal: -1228.208815 hartree
zpe.sumelectthermalent: -1228.207871 hartree
zpe.sumelectthermalfe: -1228.278807 hartree
dipole: 0.0008 0.1085 -0.0353
dipole: 0.1141
quadrupole: -155.4971 -155.9647 -191.4277
quadrupole: -0.0088 -0.0008 0.4594
quadrupole: 12.1327 11.6651 -23.7978 -0.0088 -0.0008 0.4594
hfenergy: -1228.6187822 hartree
pointgroup: C01 [X(C32H18)]
dipole: -0.0003201 -0.0428224 -0.0134239 debye
polarizability: 584.4198173|-0.0313852|493.0051897|0.0215532|-7.5321135|163.363851 unknown
InChI: InChI=1S/C32H18/c1-3-11-21-19(9-1)17-27-23-13-5-6-14-24(23)28-18-20-10-2-4-12-22(20)30-26-16-8-7-15-25(26)29(21)31(27)32(28)30/h1-18H
charge 0 multiplicity 1
50 atoms
C  0.729135 -0.325893 0.114834
C  -0.728627 -0.326066 0.114398
C  1.442742 0.911901 0.041582
C  -1.442389 0.911566 0.040814
C  1.451681 -1.587367 0.095797
C  -1.450987 -1.587646 0.094775
C  0.721088 2.124085 0.44372
C  -0.721315 2.123931 0.442969
C  0.715819 -2.851488 0.308372
C  -0.715045 -2.851636 0.307826
C  2.84017 0.906305 -0.356258
C  -2.83984 0.905946 -0.356506
C  2.83558 -1.566022 -0.111231
C  -2.834802 -1.566502 -0.113042
C  3.541477 -0.358971 -0.393225
C  -3.540908 -0.359408 -0.394422
C  1.403067 3.256879 0.990075
C  -1.404491 3.256804 0.987532
C  1.401856 -4.081881 0.525238
C  -1.400999 -4.082153 0.524242
C  3.548845 2.069174 -0.813761
C  -3.54896 2.069421 -0.811639
C  4.930405 -0.395677 -0.749298
C  -4.929886 -0.395952 -0.750322
C  0.708294 4.37046 1.481075
C  -0.710746 4.370513 1.479631
C  0.709474 -5.285347 0.727467
C  -0.708528 -5.285484 0.726972
C  4.894504 2.002492 -1.189669
C  -4.894696 2.002927 -1.187305
C  5.606141 0.765248 -1.125685
C  -5.605928 0.765338 -1.125108
H  3.409673 -2.497299 -0.127545
H  -3.408757 -2.497858 -0.129729
H  2.489032 3.222202 1.101349
H  -2.490752 3.222105 1.096286
H  2.494697 -4.098307 0.555972
H  -2.493858 -4.098787 0.554219
H  3.012608 3.014452 -0.928672
H  -3.013048 3.01517 -0.924497
H  5.44739 -1.362633 -0.746668
H  -5.446737 -1.362981 -0.748583
H  1.259943 5.212532 1.912846
H  -1.263256 5.212625 1.91022
H  1.262544 -6.215192 0.897982
H  -1.261539 -6.215433 0.897108
H  5.401949 2.90229 -1.554387
H  -5.402549 2.903182 -1.550319
H  6.664542 0.727646 -1.404907
H  -6.664415 0.727888 -1.404024
