program: Gaussian 09
title: 000035577
version: EM64L-G09RevD.01
frameworkgroup: C1[X(C11H16Cl3N3O)]
method: RPBEPBE
basis: SDD
operation: Freq
keyword: #p
keyword: freq=noraman
keyword: PBEPBE/SDD
title: #p freq=noraman PBEPBE/SDD
converged: NO YES NO NO
title: Mulliken charges:
elementType: Cl Cl Cl O N N N C C C C C C C C C C C H H H H H H H H H H H H H H H H
charge: 0.109830 0.127022 0.110430 -0.190493 -0.048219 0.002834 0.011896 -0.363015 -0.350250 -0.392776 -0.354410 -0.295326 -0.693650 0.037759 0.282688 0.047621 -0.758823 -0.740602 0.192655 0.192498 0.191351 0.192031 0.217895 0.217230 0.195758 0.195942 0.233355 0.236305 0.217725 0.210750 0.210651 0.251141 0.249240 0.252957
chargesum: 0.00000
title: Mulliken charges with hydrogens summed into heavy atoms:
elementType: Cl Cl Cl O N N N C C C C C C C C C C C
charge: 0.109830 0.127022 0.110430 -0.190493 -0.048219 0.002834 0.011896 0.022138 0.033133 0.042349 0.037289 0.174334 -0.054525 0.037759 0.282688 0.047621 -0.758823 0.012736
polarizability: 2.32741392e+02 1.33078881e+01 1.74337634e+02 9.01630139e-01 6.53013148e-01 1.27816452e+02
1716.lowfreq: -33.2167 -15.5793 -9.6806 -5.8816 -0.0004 0.0009 0.0015 1.8328 19.3417
frequency: -33.2084 -15.0325 19.2586 25.5662 41.1243 64.3557 84.1344 90.0813 100.2946 124.6744 137.0938 138.8805 174.2297 184.6972 203.5101 217.5632 219.5119 220.3432 225.7960 261.0765 292.4485 304.8926 357.5949 380.8507 419.0398 439.9943 543.5781 556.3419 594.4757 630.9396 650.0870 726.1536 730.1691 746.9278 751.2104 752.8188 794.6778 823.9105 874.8057 880.1560 893.1839 902.8830 964.3565 983.5671 993.5217 1009.9456 1047.2842 1051.6666 1070.3982 1074.2901 1083.7309 1126.7840 1146.3145 1191.2126 1195.6344 1237.5684 1243.5154 1274.5118 1283.9829 1288.9302 1291.0603 1295.5619 1317.0109 1339.6825 1355.4083 1361.9987 1389.9915 1393.5812 1418.6547 1428.5083 1451.0000 1463.0502 1465.8591 1467.2690 1468.6781 1475.5133 1476.5568 1483.4696 1489.2651 1493.6515 2955.2188 2959.4764 2969.5104 2973.1433 2992.5486 2995.6633 2998.0299 3008.3823 3010.9978 3032.4377 3053.7338 3069.3247 3073.5089 3087.6553 3089.0831 3140.3102
redmass: 1.0143 21.4837 4.1118 3.9999 1.7770 3.3244 7.4700 4.6710 1.8820 2.6248 2.2266 8.0548 6.8787 4.4409 5.5605 12.5793 5.3756 10.0310 1.1973 5.2014 19.5778 6.1354 4.5653 13.9672 3.8511 3.2903 5.2821 5.9605 5.0079 9.3875 7.1370 1.0666 10.1349 1.1189 9.4760 9.2431 1.1538 9.8122 4.8687 1.2252 2.1916 12.1996 2.7075 1.1537 8.3339 3.9155 2.9589 1.6779 2.6440 3.1757 2.1091 2.8205 1.4323 8.4725 1.5276 1.2913 1.2988 1.1154 2.4321 1.0871 1.1104 1.9588 3.8110 1.6337 1.6547 1.8185 1.2163 1.3516 4.2689 2.2853 1.2555 1.1014 1.0727 1.2359 1.2811 1.0878 1.0566 1.1686 1.2304 2.5677 1.0589 1.0590 1.0595 1.0362 1.0979 1.0600 1.0416 1.1016 1.0569 1.1042 1.1040 1.1008 1.0993 1.1086 1.0905 1.1022
irintensity: 0.4517 0.0258 0.0083 0.1208 0.2384 0.3992 0.5698 0.4973 1.3383 0.4740 2.2718 1.2986 1.1631 0.9238 1.9087 0.0231 0.5734 0.5555 0.0759 2.2042 0.4501 0.1449 0.3091 0.0584 7.7488 0.5727 13.6757 11.5875 40.4173 18.9293 39.2429 12.0219 93.2942 4.5877 95.5149 90.9881 1.2748 1.0193 76.1914 3.4176 8.1794 7.1189 14.8802 0.2470 17.7584 2.9564 5.3302 14.5684 15.9717 67.4263 5.0093 2.8297 1.6939 19.5538 0.0144 0.7831 0.0301 0.2280 173.3189 0.3467 0.9902 14.8371 297.7343 4.1225 2.4837 58.1622 12.5889 56.7141 129.8197 254.4867 136.4253 1.2175 1.4614 32.7332 43.4337 7.0902 11.3782 59.7789 67.0751 323.0791 0.2164 6.1532 86.4939 40.1294 0.9268 21.0990 1.0220 0.5455 25.3235 40.0305 20.6346 86.3743 51.3017 52.2240 9.7502 4.9997
temp: 298.150 k
press: 1.00000 atm
elementType: 17 17 17 8 7 7 7 6 6 6 6 6 6 6 6 6 6 6 1 1 1 1 1 1 1 1 1 1 1 1 1 1 1 1
symmnumber: 1
zpe: 679367.3 jmol-1
zpe.correction: 0.258757 hartree
zpe.thermalcorrener: 0.277994 hartree
zpe.thermalcorrenthalpy: 0.278938 hartree
zpe.thermalcorrgfe: 0.207901 hartree
zpe.sumelectzpe: -2047.015589 hartree
zpe.sumelectthermal: -2046.996352 hartree
zpe.sumelectthermalent: -2046.995408 hartree
zpe.sumelectthermalfe: -2047.066445 hartree
dipole: -2.6942 0.7614 0.1068
dipole: 2.8017
quadrupole: -125.4095 -130.9873 -125.9845
quadrupole: 11.1594 0.1992 0.5194
quadrupole: 2.0509 -3.5268 1.4759 11.1594 0.1992 0.5194
hfenergy: -2047.274346 hartree
pointgroup: C01 [X(C11H16Cl3N3O1)]
dipole: -1.0278199 -0.3960342 -0.0419678 debye
polarizability: 234.6889162|-7.7150842|172.3889644|-0.9897112|0.5938232|127.8175967 unknown
InChI: InChI=1S/C11H16Cl3N3O/c1-3-4-5-6-7-18-10-16-8(2)15-9(17-10)11(12,13)14/h3-7H2,1-2H3
charge 0 multiplicity 1
34 atoms
Cl 4.12168 2.111608 -1.521395
Cl 1.749071 3.132215 0.034001
Cl 4.163279 2.096566 1.513717
O  -0.5383 -1.338732 0.034498
N  1.195315 0.255487 0.021599
N  1.625374 -2.140297 0.015621
N  3.470021 -0.565354 -0.002286
C  -3.98045 0.329712 -0.015911
C  -5.417121 -0.236037 0.046717
C  -2.899577 -0.775005 0.057963
C  -6.503581 0.857835 -0.062491
C  -1.495415 -0.178139 0.022665
C  -7.937363 0.289986 0.008306
C  0.792175 -1.058651 0.022812
C  2.538932 0.425023 0.009395
C  2.960708 -1.845785 -0.000495
C  3.08688 1.860047 0.00956
C  3.931191 -2.989934 -0.035062
H  -3.837011 1.051054 0.815451
H  -3.857163 0.907325 -0.955616
H  -5.557825 -0.974421 -0.7699
H  -5.552442 -0.793248 0.996831
H  -3.018695 -1.475709 -0.790181
H  -3.023671 -1.365398 0.985514
H  -6.358077 1.599357 0.749647
H  -6.369448 1.410275 -1.014881
H  -1.307874 0.412475 -0.892414
H  -1.279692 0.45971 0.898424
H  -8.694227 1.091802 -0.069035
H  -8.12095 -0.428361 -0.812847
H  -8.105954 -0.242992 0.963063
H  3.550039 -3.834318 0.560513
H  4.046463 -3.348234 -1.075955
H  4.91861 -2.666958 0.326373
