program: Gaussian 09
title: 000035567
version: EM64L-G09RevD.01
frameworkgroup: C1[X(C6H8ClN3O2)]
method: RPBEPBE
basis: SDD
operation: Freq
keyword: #p
keyword: freq=noraman
keyword: PBEPBE/SDD
title: #p freq=noraman PBEPBE/SDD
converged: NO YES NO NO
title: Mulliken charges:
elementType: Cl O O N N N C C C C C C H H H H H H H H
charge: -0.043311 -0.202043 -0.202043 -0.003972 -0.003993 -0.128160 0.103170 0.074654 0.074659 -0.685354 -0.499755 -0.499755 0.285987 0.285992 0.240313 0.243355 0.238295 0.240312 0.238295 0.243354
chargesum: 0.00000
title: Mulliken charges with hydrogens summed into heavy atoms:
elementType: Cl O O N N N C C C C C C
charge: -0.043311 -0.202043 -0.202043 -0.003972 -0.003993 -0.128160 0.103170 0.074654 0.074659 -0.113376 0.222207 0.222207
polarizability: 1.35392728e+02 1.16682545e-03 1.11496615e+02 -2.14580135e+00 1.11134162e-03 6.70714858e+01
1716.lowfreq: -13.3322 -0.0022 0.0013 0.0017 1.5744 5.3523 38.8792 69.1852 92.5654
frequency: 38.8326 69.1828 92.5641 122.5020 123.4739 141.2507 160.7497 212.1755 224.3108 233.7370 265.3712 304.4348 450.3467 494.9744 537.4709 580.1228 622.3045 639.2764 712.8277 732.8747 815.2353 894.8361 896.7278 900.3130 917.5113 1037.2920 1050.1194 1111.7811 1112.4983 1134.4699 1143.0260 1169.3600 1221.8638 1268.7550 1318.1590 1318.7219 1390.7236 1425.6029 1431.5381 1451.0325 1453.5233 1455.5800 1457.0524 1471.6218 1473.8802 1480.1584 3006.9337 3007.8211 3092.6707 3111.6119 3111.6423 3154.7985 3155.3861 3188.0723
redmass: 6.8240 6.4289 2.8024 1.1067 1.1506 5.6908 3.2194 5.8631 7.3318 2.8837 10.0981 2.7617 5.0400 6.2921 8.0063 7.1337 5.4502 7.7064 12.0497 8.6724 11.2006 11.1472 5.2665 9.2283 2.0562 3.0619 9.2556 1.2537 1.2536 1.3492 1.3732 1.6532 6.1057 1.1798 5.6799 4.2635 1.9637 1.7267 1.2039 1.0512 1.0531 1.0833 1.3179 2.0340 2.9194 3.9321 1.0294 1.0295 1.0560 1.1048 1.1048 1.1048 1.1047 1.1130
irintensity: 0.3906 5.3304 0.0046 0.3108 0.0001 7.0397 0.4083 5.1069 0.0096 22.3950 4.7443 1.8769 4.3199 0.0246 10.4669 2.5740 4.1325 39.9034 0.0100 24.5352 8.9502 4.6584 8.1043 54.4154 3.6304 46.9627 56.5890 0.0003 0.2177 9.6349 20.9186 30.5865 8.7271 6.4364 82.3627 421.6783 62.7293 53.3745 4.1072 0.6786 33.0291 120.8170 103.0866 65.0563 413.5318 444.4409 5.2617 61.3702 9.0061 0.0787 49.6981 35.1771 1.3460 0.8906
temp: 298.150 k
press: 1.00000 atm
elementType: 17 8 8 7 7 7 6 6 6 6 6 6 1 1 1 1 1 1 1 1
symmnumber: 1
zpe: 379151.0 jmol-1
zpe.correction: 0.144411 hartree
zpe.thermalcorrener: 0.156694 hartree
zpe.thermalcorrenthalpy: 0.157638 hartree
zpe.thermalcorrgfe: 0.104409 hartree
zpe.sumelectzpe: -1007.264624 hartree
zpe.sumelectthermal: -1007.252341 hartree
zpe.sumelectthermalent: -1007.251397 hartree
zpe.sumelectthermalfe: -1007.304626 hartree
dipole: -5.5924 0.0000 -0.5949
dipole: 5.6239
quadrupole: -64.4974 -81.8052 -73.8258
quadrupole: -0.0021 -7.2630 0.0007
quadrupole: 8.8787 -8.4291 -0.4496 -0.0021 -7.2630 0.0007
hfenergy: -1007.4090345 hartree
pointgroup: C01 [X(C6H8Cl1N3O2)]
dipole: 2.180439 -0.0003206 -0.3759969 debye
dipolederiv: -0.4589659 0.0000398 0.100067 0.0000077 -0.14228 0.0000254 0.2395302 -0.0000052 -0.339986 -0.9522763 -0.6033095 -0.0665776 -0.773246 -1.1248615 -0.0846166 -0.0939274 -0.084913 -0.3267363 -0.9516858 0.6032258 -0.066476 0.7731918 -1.1254565 0.0845442 -0.0938406 0.0848892 -0.3267222 -1.168556 0.5622093 -0.067979 0.2188414 -0.7900325 -0.0115145 -0.1491451 0.082409 -0.1755561 -1.1688704 -0.5620518 -0.0680255 -0.218622 -0.7896916 0.0114561 -0.1491846 -0.0824251 -0.17557 -0.5359202 -0.0001767 -0.0288817 -0.0001817 -1.3615018 -0.0000645 -0.0520604 -0.0000671 -0.1830304 1.0330654 0.000015 -0.0286616 -0.0000098 1.018565 0.0001044 0.0011893 0.0000882 -0.0599005 1.2341293 0.5892881 0.0915545 0.7530683 1.6891174 0.0669713 0.1391407 0.0811735 0.2777447 1.2335647 -0.5890789 0.091464 -0.7528893 1.6896983 -0.0668361 0.1390634 -0.0810858 0.2777202 0.281774 0.0000141 -0.1393826 -0.0000073 0.1680244 -0.0000413 -0.1712348 -0.0000374 0.4439127 0.6870256 0.3370179 0.0496768 0.1267001 0.3237638 0.0169717 0.069178 0.0546258 0.2709942 0.6868278 -0.3371727 0.0496382 -0.1268636 0.3239709 -0.0169862 0.0691516 -0.0546571 0.2709899 0.0471055 -0.0015723 0.0383145 -0.0602674 0.0171215 -0.0775028 0.030809 -0.0509625 -0.0011223 0.0471486 0.0015346 0.0383575 0.0602554 0.0170413 0.0774887 0.0308473 0.0509615 -0.0010655 -0.0182501 -0.0631032 -0.021377 0.0529601 0.0795938 0.1034929 -0.0587923 0.0551646 -0.0676441 0.0602694 -0.0424713 -0.0089293 -0.0976447 -0.1112699 -0.0101949 -0.0094062 -0.0037444 0.1268651 -0.0492246 -0.0412218 0.033754 0.0853539 0.074961 -0.0879952 0.0634354 -0.0756767 -0.0350579 -0.0182437 0.0631466 -0.0214126 -0.0529102 0.0796027 -0.1034702 -0.0588192 -0.0551246 -0.0676587 -0.0492478 0.0412703 0.0337977 -0.0853088 0.0749661 0.0879889 0.0634626 0.0756595 -0.0350423 0.0603306 0.0423966 -0.0089214 0.0975718 -0.1113324 0.0101785 -0.0093972 0.0037275 0.1268655 unknown
polarizability: 135.3836818|-0.0022906|111.4966154|-2.285265|0.0011385|67.0805321 unknown
InChI: InChI=1S/C6H8ClN3O2/c1-11-5-8-4(3-7)9-6(10-5)12-2/h3H2,1-2H3
charge 0 multiplicity 1
20 atoms
Cl -3.78929 0.000465 1.090673
O  1.157357 2.35512 0.005896
O  1.15634 -2.355559 0.005603
N  -0.823394 -1.217821 -0.299817
N  -0.822872 1.218276 -0.299641
N  1.253949 -0.000243 0.038827
C  -1.438952 0.000366 -0.388045
C  0.523547 1.148027 -0.083302
C  0.523052 -1.148184 -0.083489
C  -2.926346 0.000705 -0.595795
C  2.620577 2.342471 0.243206
C  2.619557 -2.343565 0.242955
H  -3.261747 -0.915659 -1.096143
H  -3.261375 0.917446 -1.095703
H  2.850204 1.843526 1.199156
H  2.892649 3.406123 0.273955
H  3.139289 1.820319 -0.577756
H  2.849377 -1.844802 1.198955
H  3.138514 -1.82157 -0.577951
H  2.891165 -3.407338 0.273617
