program: Gaussian 09
title: 000035583
version: EM64L-G09RevD.01
frameworkgroup: C1[X(C9H9Cl6N3O)]
method: RPBEPBE
basis: SDD
operation: Freq
keyword: #p
keyword: freq=noraman
keyword: PBEPBE/SDD
title: #p freq=noraman PBEPBE/SDD
converged: YES YES NO NO
title: Mulliken charges:
elementType: Cl Cl Cl Cl Cl Cl O N N N C C C C C C C C C H H H H H H H H H
charge: 0.126059 0.136053 0.126437 0.120873 0.152917 0.121389 -0.179669 0.048594 -0.038829 0.094186 -0.369857 -0.344858 -0.278572 -0.684735 0.026527 0.240741 0.298698 -0.774196 -0.776348 0.216743 0.216838 0.198997 0.198966 0.236277 0.236305 0.214224 0.214210 0.222030
chargesum: 0.00000
title: Mulliken charges with hydrogens summed into heavy atoms:
elementType: Cl Cl Cl Cl Cl Cl O N N N C C C C C C C C C
charge: 0.126059 0.136053 0.126437 0.120873 0.152917 0.121389 -0.179669 0.048594 -0.038829 0.094186 0.063724 0.053105 0.194010 -0.034271 0.026527 0.240741 0.298698 -0.774196 -0.776348
polarizability: 2.32805892e+02 7.05434001e+00 1.84085975e+02 4.31905259e-02 6.58176627e-03 1.41906410e+02
1716.lowfreq: -12.1243 -8.7077 0.0006 0.0014 0.0018 3.5796 4.2184 5.1898 32.4557
frequency: -10.5613 -7.7398 32.3558 44.3341 54.0607 62.7286 77.6060 100.7248 111.7091 136.9823 138.8567 160.1642 173.8586 180.7775 198.5225 218.5974 227.5267 235.7635 239.2518 251.6384 279.8763 282.2805 310.8523 331.4700 357.9328 381.5305 394.4826 433.5128 546.2203 608.1014 614.4425 650.0639 656.5606 736.5270 742.1954 746.7487 769.3842 777.0530 784.3369 799.0945 838.8733 877.5222 900.3589 906.7090 931.7085 1007.1619 1028.9786 1043.0432 1081.1894 1124.1807 1143.7146 1184.1491 1212.6507 1271.0456 1274.7805 1288.4851 1288.7800 1306.2506 1338.5158 1358.1093 1396.1930 1422.0574 1433.9625 1462.0923 1471.5392 1476.7878 1479.3246 1483.9768 1491.0890 2972.0466 2980.1908 2999.7080 3014.2504 3016.6175 3056.0277 3076.9714 3081.3570 3092.4167
redmass: 26.6751 21.3310 5.7220 5.4420 1.6254 8.8205 21.7299 8.1115 2.9539 2.7124 6.7610 8.4908 9.8165 19.2003 10.9653 8.1316 5.9018 1.3860 9.7164 25.5420 22.9801 8.3235 20.5480 12.1658 7.3592 21.2173 7.9113 5.0832 8.1227 13.4811 10.3406 13.0358 12.8955 12.1965 1.0787 11.1903 12.0078 12.1116 12.1070 1.1410 12.5445 7.9310 13.5758 1.8889 1.1668 12.0294 7.0051 4.1720 2.2408 2.6710 1.4542 10.8940 1.3506 1.3942 1.1632 5.2886 1.0755 12.0380 1.5840 1.7917 1.2204 4.3070 11.1805 1.3176 1.1187 1.2872 1.0415 1.8955 1.1990 1.0590 1.0364 1.0601 1.0567 1.1009 1.1036 1.1016 1.0995 1.1085
irintensity: 0.0036 0.0010 0.0103 0.2010 0.2885 0.3191 0.0474 0.9730 0.4363 2.0638 0.3603 1.6754 2.6884 1.2025 0.6427 0.0852 0.4515 0.4589 1.4447 0.3930 0.0107 1.1793 2.4936 0.4160 0.4970 0.8360 1.1501 5.3345 12.9650 0.2206 7.0000 152.8552 96.6279 178.8993 18.2230 146.0741 0.1856 70.5057 20.4710 0.6681 3.3509 153.6759 5.1703 1.4913 0.5929 41.1383 4.6101 57.3197 10.5993 2.2978 2.3071 16.9317 0.0516 52.8012 0.0331 257.0796 0.2531 6.1644 80.9958 129.9536 2.5202 101.3906 307.0656 97.8158 18.0485 157.4159 13.7848 248.7782 70.4729 27.3325 32.9423 16.7702 22.1438 8.8106 3.5126 42.6467 43.9321 58.3116
temp: 298.150 k
press: 1.00000 atm
elementType: 17 17 17 17 17 17 8 7 7 7 6 6 6 6 6 6 6 6 6 1 1 1 1 1 1 1 1 1
symmnumber: 1
zpe: 458534.2 jmol-1
zpe.correction: 0.174646 hartree
zpe.thermalcorrener: 0.194272 hartree
zpe.thermalcorrenthalpy: 0.195216 hartree
zpe.thermalcorrgfe: 0.124225 hartree
zpe.sumelectzpe: -3346.705357 hartree
zpe.sumelectthermal: -3346.685732 hartree
zpe.sumelectthermalent: -3346.684788 hartree
zpe.sumelectthermalfe: -3346.755779 hartree
dipole: -5.0159 0.0652 -0.0013
dipole: 5.0163
quadrupole: -139.2425 -163.0642 -148.9889
quadrupole: 2.2393 -0.0104 -0.0018
quadrupole: 11.1894 -12.6324 1.4430 2.2393 -0.0104 -0.0018
hfenergy: -3346.8800037 hartree
pointgroup: C01 [X(C9H9Cl6N3O1)]
dipole: 1.9654187 -0.1790068 -0.002119 debye
polarizability: 233.6049148|3.1922926|183.286826|-0.1155887|0.0035033|141.9065363 unknown
InChI: InChI=1S/C9H9Cl6N3O/c1-2-3-4-19-7-17-5(8(10,11)12)16-6(18-7)9(13,14)15/h2-4H2,1H3
charge 0 multiplicity 1
28 atoms
Cl -2.141313 -3.14136 -1.517964
Cl 0.393847 -3.733267 0.004695
Cl -2.14608 -3.139661 1.518288
Cl -3.898417 1.512563 1.532332
Cl -2.422116 3.643028 -0.00989
Cl -3.920471 1.495092 -1.505217
O  1.831674 1.092814 -0.005807
N  -0.437626 1.479999 -0.001797
N  0.425033 -0.796594 -0.001955
N  -1.956678 -0.405629 0.003108
C  4.257715 1.011821 -0.00342
C  5.540626 0.144742 -0.002114
C  3.002978 0.143826 -0.006118
C  6.821975 1.005389 0.00149
C  0.586496 0.565634 -0.002371
C  -1.672639 0.932189 0.001675
C  -0.86552 -1.213859 0.000568
C  -1.149623 -2.722651 0.001653
C  -2.890521 1.8660 0.003912
H  4.247607 1.668724 0.886711
H  4.250463 1.670347 -0.892376
H  5.542311 -0.517804 -0.891187
H  5.538921 -0.520176 0.885191
H  2.925129 -0.49472 -0.904412
H  2.923475 -0.497942 0.889702
H  6.864744 1.6570 -0.890929
H  6.860442 1.655811 0.894985
H  7.728268 0.373684 0.003245
