program: Gaussian 09
title: 000035688
version: EM64L-G09RevD.01
frameworkgroup: C1[X(C18H18N4O6S4)]
method: RPBEPBE
basis: SDD
operation: Freq
keyword: #p
keyword: freq=noraman
keyword: PBEPBE/SDD
title: #p freq=noraman PBEPBE/SDD
converged: YES YES NO NO
title: Mulliken charges:
elementType: S S S S O O O O O O N N N N C C C C C C C C C C C C C C C C C C H H H H H H H H H H H H H H H H H H
charge: 0.292234 0.292234 0.990019 0.990019 -0.568169 -0.568170 -0.502968 -0.503451 -0.502973 -0.503447 -0.194750 -0.194750 -0.066548 -0.066549 0.687955 0.687953 -0.395365 -0.395362 -0.370622 -0.370623 -0.189513 -0.189512 -0.322742 -0.322742 -0.271445 -0.271450 -0.106768 -0.106768 -0.229260 -0.229255 -0.662861 -0.662860 0.266526 0.220999 0.266527 0.221000 0.260184 0.260183 0.294109 0.294113 0.284468 0.284465 0.228243 0.248867 0.228601 0.228243 0.248867 0.228601 0.382256 0.382257
chargesum: 0.00000
title: Mulliken charges with hydrogens summed into heavy atoms:
elementType: S S S S O O O O O O N N N N C C C C C C C C C C C C C C C C C C
charge: 0.292234 0.292234 0.990019 0.990019 -0.185913 -0.185913 -0.502968 -0.503451 -0.502973 -0.503447 -0.194750 -0.194750 -0.066548 -0.066549 0.687955 0.687953 -0.395365 -0.395362 0.116903 0.116904 -0.189513 -0.189512 -0.062558 -0.062559 0.022663 0.022663 -0.106768 -0.106768 0.055208 0.055210 0.042851 0.042851
polarizability: 8.36924816e+02 7.94737211e+00 3.23192719e+02 3.56938253e-05 -1.92895808e-03 1.78470903e+02
1716.lowfreq: -5.4027 -1.4344 -0.0014 -0.0001 0.0010 3.0444 9.9151 18.4017 20.3062
frequency: 9.9063 18.3021 20.3004 24.4943 33.9827 40.2581 52.1504 55.9304 65.2460 67.0277 70.3860 93.3926 108.8608 112.6704 120.7590 137.7777 155.8325 160.8270 174.1297 175.0186 190.5483 195.1575 199.1840 205.6302 216.3747 216.8774 242.8426 244.4622 261.4263 292.3169 295.3526 303.8743 305.8758 319.9352 349.6827 350.0621 358.8976 358.9868 393.0695 402.1271 407.8459 411.5842 422.2365 438.1807 438.9525 452.4167 479.1487 483.6712 488.2339 517.5622 526.2618 537.0584 540.1274 547.4084 569.1648 572.6732 594.4392 595.7065 644.2672 676.1973 685.8448 706.4119 717.8647 739.5782 740.2671 777.8309 780.6781 816.7966 816.9434 827.5278 831.2871 836.6102 839.8550 890.8640 890.8822 919.8912 932.5002 955.9239 955.9325 967.0769 967.1171 997.1781 1027.1955 1034.0824 1040.2101 1046.0183 1046.2711 1060.0554 1060.1978 1079.9310 1088.4862 1096.0709 1136.5030 1139.7899 1146.7615 1147.9519 1216.2765 1238.7666 1264.8003 1269.2325 1298.0985 1309.3972 1336.7478 1343.2557 1366.0841 1367.5320 1394.2354 1394.3729 1407.9700 1410.1861 1414.4529 1416.4269 1468.3617 1468.4311 1469.1571 1469.4684 1478.0919 1479.2849 1486.4569 1486.6761 1578.2777 1579.7755 1581.6548 1590.0722 1600.4555 1608.7536 2994.4767 2994.5239 3021.5204 3021.6244 3081.8049 3081.8147 3095.4810 3095.4873 3108.0866 3108.1106 3160.9065 3160.9120 3165.3712 3165.3817 3178.2059 3178.2141 3477.9360 3477.9567
redmass: 8.6024 8.3261 8.7300 8.1856 5.0096 10.7020 3.1123 2.9024 6.0815 8.2780 4.8272 5.8241 6.5124 6.7814 11.6463 7.9765 6.7806 3.3047 1.7872 2.2528 1.8373 2.2085 2.2027 1.7495 4.2762 7.7015 5.2799 2.5698 2.2588 4.1890 4.5862 6.1992 5.5853 6.1519 3.6732 6.8096 5.8591 8.7049 7.0783 7.3050 9.7543 8.2895 6.1936 3.4322 3.7106 6.5835 12.2386 6.9557 7.0659 9.6619 8.7846 8.5600 6.4187 7.2089 6.5617 5.6474 5.0581 4.8521 5.9338 6.7329 8.7483 5.4523 5.4401 3.8716 3.8315 1.8929 1.5214 1.4899 1.4850 2.7268 7.4016 5.6482 3.5529 1.3899 1.3896 3.1146 2.7830 1.3837 1.3832 14.7513 14.7213 5.9794 4.1149 4.4950 2.9249 1.2274 1.2701 2.4817 2.1108 3.2375 1.9901 2.3188 1.8656 1.7805 1.3785 1.3683 2.1519 1.6343 1.3632 1.3497 2.0057 3.1113 1.6951 1.7082 1.7055 1.7862 1.2225 1.2207 3.2836 3.5001 5.2206 5.0285 1.2010 1.1472 1.6597 1.7364 1.4118 1.4149 1.0827 1.1018 7.9702 8.1657 7.5582 7.2882 10.9288 9.9481 1.0358 1.0358 1.0630 1.0631 1.1008 1.1008 1.0988 1.0988 1.1028 1.1028 1.0887 1.0887 1.0934 1.0934 1.0971 1.0971 1.0661 1.0661
irintensity: 1.0473 1.0007 0.1676 3.1186 1.0825 0.4087 0.0027 0.0259 0.3381 0.1216 0.4317 2.1943 1.0858 0.1762 0.2122 3.4762 0.0665 24.8950 0.0950 59.9866 0.1693 10.3146 0.0000 17.7422 2.2522 0.9375 0.6354 47.4140 0.0912 49.9640 19.9018 63.0644 7.3653 16.1735 56.6836 0.0072 0.0524 2.1738 8.3786 0.2197 224.9398 2.0695 44.6955 8.4347 0.9151 0.0677 6.3652 25.5525 0.4537 59.8665 103.1633 150.5529 2.7689 30.1727 111.7757 146.9701 34.4342 2.9208 11.4626 5.9636 1.1039 4.0595 11.8634 2.3705 5.5065 6.3921 76.4839 101.0222 0.3431 18.0197 66.0739 32.4207 260.3910 0.9010 31.3037 0.0465 10.1529 0.3250 5.7684 0.0031 161.8448 0.5844 10.2039 0.0000 2.3139 102.0436 18.1261 392.5811 12.7250 2.4258 7.2558 4.5985 156.8523 0.3312 29.2853 0.0799 135.4355 0.1370 105.7678 0.2016 132.0060 2.6438 121.7287 0.2258 110.4033 0.4644 9.8013 26.0716 5.0706 0.6509 36.0031 0.0919 9.9584 1.0178 269.6041 4.8418 218.6322 4.3967 65.9957 17.3812 0.0102 152.1734 1524.6722 0.0097 0.0016 1295.3970 16.7872 16.9831 28.8186 28.0721 5.9537 1.2197 45.5830 7.8749 34.0120 1.4086 0.8247 4.5977 17.0459 0.0134 4.6843 12.9050 37.0734 54.5059
temp: 298.150 k
press: 1.00000 atm
elementType: 16 16 16 16 8 8 8 8 8 8 7 7 7 7 6 6 6 6 6 6 6 6 6 6 6 6 6 6 6 6 6 6 1 1 1 1 1 1 1 1 1 1 1 1 1 1 1 1 1 1
symmnumber: 1
zpe: 902271.6 jmol-1
zpe.correction: 0.343657 hartree
zpe.thermalcorrener: 0.377281 hartree
zpe.thermalcorrenthalpy: 0.378226 hartree
zpe.thermalcorrgfe: 0.274186 hartree
zpe.sumelectzpe: -2956.614274 hartree
zpe.sumelectthermal: -2956.580649 hartree
zpe.sumelectthermalent: -2956.579705 hartree
zpe.sumelectthermalfe: -2956.683745 hartree
dipole: 0.0003 -0.0006 2.7430
dipole: 2.7430
quadrupole: -308.8885 -194.7427 -223.5116
quadrupole: -28.6393 0.0013 -0.0021
quadrupole: -66.5076 47.6383 18.8693 -28.6393 0.0013 -0.0021
hfenergy: -2956.9579306 hartree
pointgroup: C01 [X(C18H18N4O6S4)]
dipole: 0.0001409 0.0002515 -1.0791944 debye
polarizability: 836.4761471|-17.1305316|323.6413878|-0.0000702|-0.001928|178.4709031 unknown
InChI: InChI=1S/C18H18N4O6S4/c1-3-21-13-7-5-11(31(23,24)25)9-15(13)29-17(21)19-20-18-22(4-2)14-8-6-12(32(26,27)28)10-16(14)30-18/h5-10,23,26H,3-4H2,1-2H3
charge 0 multiplicity 1
50 atoms
S  -2.533301 1.237104 0.12098
S  2.533336 -1.237107 0.120963
S  -8.197253 0.738316 0.027671
S  8.197289 -0.73834 0.027694
O  -8.350552 0.805939 -1.827941
O  8.350702 -0.805753 -1.827911
O  -9.270338 -0.335993 0.586879
O  -8.176664 2.256981 0.588473
O  9.270371 0.335892 0.587063
O  8.176633 -2.257054 0.588351
N  -2.596792 -1.457536 0.187328
N  2.596833 1.457534 0.187276
N  -0.375819 -0.597796 0.166373
N  0.375858 0.597798 0.166341
C  -3.942272 -1.07252 0.136762
C  3.942313 1.072515 0.136729
C  -4.122589 0.344665 0.10664
C  4.122627 -0.344671 0.106623
C  -2.137789 -2.868427 0.206297
C  2.137833 2.868427 0.206238
C  -1.671816 -0.40659 0.160441
C  1.671855 0.40659 0.160384
C  -5.063288 -1.937836 0.131599
C  5.063331 1.937827 0.13157
C  -5.39892 0.916626 0.065461
C  5.398956 -0.916636 0.065463
C  -6.48582 0.019462 0.063135
C  6.485859 -0.019475 0.063134
C  -6.356806 -1.379792 0.091949
C  6.356849 1.37978 0.091933
C  -2.063063 -3.482154 -1.206094
C  2.063131 3.482153 -1.206154
H  -1.140733 -2.870077 0.675453
H  -2.823538 -3.439338 0.857985
H  1.140769 2.87008 0.675378
H  2.823572 3.439336 0.857937
H  -4.939663 -3.023511 0.151257
H  4.939709 3.023504 0.151215
H  -5.563298 1.998094 0.053897
H  5.563335 -1.998104 0.053911
H  -7.247676 -2.014847 0.096972
H  7.247718 2.014836 0.09696
H  -3.044572 -3.46567 -1.711717
H  -1.339299 -2.92958 -1.828663
H  -1.727345 -4.532388 -1.13911
H  3.044647 3.465663 -1.711763
H  1.339372 2.929583 -1.828733
H  1.727419 4.532389 -1.139175
H  -9.248577 1.195873 -2.040097
H  9.248867 -1.195372 -2.040057
