program: Gaussian 09
title: 000035576
version: EM64L-G09RevD.01
frameworkgroup: C1[X(C9H12Cl3N3O)]
method: RPBEPBE
basis: SDD
operation: Freq
keyword: #p
keyword: freq=noraman
keyword: PBEPBE/SDD
title: #p freq=noraman PBEPBE/SDD
converged: NO YES NO NO
title: Mulliken charges:
elementType: Cl Cl Cl O N N N C C C C C C C C C H H H H H H H H H H H H
charge: 0.110170 0.127034 0.110275 -0.190733 -0.047471 0.003855 0.011765 -0.370367 -0.344718 -0.276398 -0.685836 0.035960 0.280664 0.047631 -0.758349 -0.740399 0.213761 0.213866 0.198108 0.198104 0.231431 0.231355 0.213294 0.213244 0.220424 0.250599 0.253436 0.249293
chargesum: 0.00000
title: Mulliken charges with hydrogens summed into heavy atoms:
elementType: Cl Cl Cl O N N N C C C C C C C C C
charge: 0.110170 0.127034 0.110275 -0.190733 -0.047471 0.003855 0.011765 0.057261 0.051494 0.186389 -0.038873 0.035960 0.280664 0.047631 -0.758349 0.012929
polarizability: 1.96374217e+02 1.48599438e+01 1.58939878e+02 -3.48622792e-01 -6.53924028e-01 1.10755050e+02
1716.lowfreq: -48.2050 -11.9442 -0.0038 -0.0025 -0.0020 3.9169 8.1574 9.0484 30.8794
frequency: -48.2020 -10.3279 30.8384 50.4960 60.9225 86.5055 109.8102 125.0554 127.1149 162.8134 175.5515 210.0717 215.3089 219.1922 232.4209 238.4373 253.2977 292.7217 314.4508 355.2099 382.1042 429.7285 537.4614 556.7589 594.8127 628.5682 650.7555 728.6634 742.2247 752.0661 752.9129 799.0473 824.4080 874.5584 902.2914 906.1714 933.6131 965.4876 994.4876 1039.0156 1051.3364 1072.5342 1084.1370 1124.3219 1145.5476 1191.4715 1213.2777 1273.2462 1276.2273 1290.3152 1292.2299 1317.7707 1348.3987 1364.9932 1391.7325 1395.2809 1418.4973 1428.2908 1451.2385 1465.2951 1468.9865 1472.4809 1477.8159 1478.4659 1488.7657 1493.9883 2972.7937 2978.7031 2998.8916 2999.1932 3011.7404 3016.9589 3054.5466 3075.1110 3079.7603 3088.3321 3089.2305 3140.3243
redmass: 1.0147 16.4968 3.0687 5.4021 1.8708 8.5845 2.6621 6.3536 2.2300 6.0363 7.1067 6.3618 3.8145 14.6105 1.3014 8.6797 5.0967 19.5801 7.8039 4.1995 12.4363 3.4570 6.0100 5.9828 4.9593 9.1841 7.1689 10.2208 1.0742 9.9231 10.5454 1.1423 9.8064 6.8176 8.2208 2.0858 1.1721 2.6646 8.6735 3.2811 1.6721 2.9853 2.2800 2.6663 1.4664 8.6695 1.3411 1.4652 1.1607 3.9285 1.0748 4.5011 1.6602 1.7695 1.2483 1.3160 4.1867 2.3319 1.2165 1.1220 1.4497 1.0947 1.0432 1.1352 1.4229 2.1771 1.0588 1.0364 1.0412 1.0601 1.0565 1.1008 1.1035 1.1017 1.0995 1.0914 1.1079 1.1019
irintensity: 0.5072 0.0210 0.0155 0.4671 1.0367 0.0604 0.5658 0.1279 3.8459 2.9344 1.0625 0.9580 0.2553 0.1533 0.2936 1.8296 0.5858 0.4590 0.0771 3.3582 0.5989 1.6045 16.1343 11.7494 40.0757 16.6105 39.3818 88.7772 13.9615 97.4129 90.3597 0.7981 1.1493 86.9273 6.0491 1.5078 0.5301 18.3913 15.7219 15.8585 13.3978 62.8205 1.5095 1.8879 2.2966 18.9279 0.0483 58.5137 0.0877 109.0611 0.1712 293.9393 1.3261 69.7011 15.6535 40.3437 170.5413 219.7107 114.3011 5.6594 65.9783 4.3209 14.2569 51.7131 116.2097 281.2985 28.6464 33.2079 0.8382 16.9585 27.3364 8.0696 2.6460 38.2868 45.6373 5.0947 74.3525 5.3317
temp: 298.150 k
press: 1.00000 atm
elementType: 17 17 17 8 7 7 7 6 6 6 6 6 6 6 6 6 1 1 1 1 1 1 1 1 1 1 1 1
symmnumber: 1
zpe: 533759.3 jmol-1
zpe.correction: 0.203298 hartree
zpe.thermalcorrener: 0.219623 hartree
zpe.thermalcorrenthalpy: 0.220568 hartree
zpe.thermalcorrgfe: 0.157551 hartree
zpe.sumelectzpe: -1968.569302 hartree
zpe.sumelectthermal: -1968.552977 hartree
zpe.sumelectthermalent: -1968.552033 hartree
zpe.sumelectthermalfe: -1968.615050 hartree
dipole: -2.6895 0.4350 -0.0752
dipole: 2.7254
quadrupole: -111.7341 -114.8217 -113.2116
quadrupole: 11.3448 -0.1296 -0.3033
quadrupole: 1.5217 -1.5659 0.0442 11.3448 -0.1296 -0.3033
hfenergy: -1968.7726006 hartree
pointgroup: C01 [X(C9H12Cl3N3O1)]
dipole: 1.028715 0.3011609 0.0286409 debye
polarizability: 199.456985|-9.7932701|155.8587727|-0.446059|0.5293333|110.7533879 unknown
InChI: InChI=1S/C9H12Cl3N3O/c1-3-4-5-16-8-14-6(2)13-7(15-8)9(10,11)12/h3-5H2,1-2H3
charge 0 multiplicity 1
28 atoms
Cl -3.43519 -1.832861 -1.52259
Cl -1.182806 -3.1112 0.021719
Cl -3.457851 -1.810611 1.512939
O  1.581732 1.09315 -0.009825
N  -0.312227 -0.308586 -0.004262
N  -0.482991 2.12009 -0.013899
N  -2.485683 0.753173 -0.008446
C  3.871501 0.29405 -0.004405
C  4.837893 -0.915798 -0.000256
C  2.413862 -0.159014 -0.006816
C  6.318012 -0.478137 0.001051
C  0.229053 0.95538 -0.007379
C  -1.666664 -0.331959 -0.003014
C  -1.842255 1.971315 -0.01297
C  -2.369822 -1.697593 0.002319
C  -2.683862 3.213765 -0.00007
H  4.057586 0.925959 0.884555
H  4.061493 0.923085 -0.894574
H  4.640057 -1.551041 -0.887253
H  4.637295 -1.54704 0.88897
H  2.153084 -0.750733 -0.9029
H  2.149422 -0.749379 0.889042
H  6.552951 0.128237 -0.893514
H  6.549365 0.134694 0.892165
H  6.994922 -1.35136 0.005568
H  -2.234085 3.988156 -0.641825
H  -3.710141 2.98478 -0.322214
H  -2.725049 3.625278 1.026384
