program: Gaussian 09
title: 000035585
version: EM64L-G09RevD.01
frameworkgroup: C1[X(C11H13Cl6N3O)]
method: RPBEPBE
basis: SDD
operation: Freq
keyword: #p
keyword: freq=noraman
keyword: PBEPBE/SDD
title: #p freq=noraman PBEPBE/SDD
converged: NO YES NO NO
title: Mulliken charges:
elementType: Cl Cl Cl Cl Cl Cl O N N N C C C C C C C C C C C H H H H H H H H H H H H H
charge: 0.125938 0.136146 0.126134 0.120571 0.152881 0.121420 -0.179277 0.048929 -0.038833 0.093831 -0.364908 -0.349748 -0.390912 -0.355051 -0.298408 -0.692782 0.027695 0.240776 0.299828 -0.774339 -0.776613 0.193907 0.193982 0.192655 0.192721 0.220476 0.220539 0.196224 0.196136 0.239666 0.239611 0.218657 0.211057 0.211094
chargesum: 0.00000
title: Mulliken charges with hydrogens summed into heavy atoms:
elementType: Cl Cl Cl Cl Cl Cl O N N N C C C C C C C C C C C
charge: 0.125938 0.136146 0.126134 0.120571 0.152881 0.121420 -0.179277 0.048929 -0.038833 0.093831 0.022980 0.035628 0.050103 0.037309 0.180869 -0.051974 0.027695 0.240776 0.299828 -0.774339 -0.776613
polarizability: 2.68374341e+02 2.04298672e+00 2.01007162e+02 7.46992512e-03 -3.21786968e-03 1.58882034e+02
1716.lowfreq: -14.2360 -9.6197 -3.9353 -0.0025 -0.0023 -0.0021 1.8683 6.1965 24.1511
frequency: -13.3068 -9.1564 23.9790 26.2883 54.7461 58.6412 74.1963 76.4701 93.6715 94.4718 116.0258 132.3065 146.6286 146.9079 154.3490 179.3636 198.4069 199.4641 219.6228 223.9281 229.1766 237.3698 252.4563 275.9484 279.9678 310.7108 319.3752 357.3252 377.9496 398.6415 426.5228 442.2870 550.3306 607.5423 616.7734 649.4264 655.8457 728.4091 737.0093 746.3834 749.4359 768.9376 775.5374 784.5728 797.6296 838.7933 876.9767 884.8380 892.4317 901.0038 988.3356 1003.1540 1011.3199 1029.0677 1052.9294 1070.5827 1084.5543 1126.3309 1146.2355 1182.8637 1196.2197 1241.2774 1245.1452 1278.7612 1282.8443 1294.1322 1296.9108 1297.7024 1305.6602 1336.0734 1355.5041 1360.3330 1390.3296 1421.4276 1433.0843 1460.5022 1467.0376 1468.5546 1475.3804 1476.5476 1481.3755 1486.8657 1491.8942 2958.2933 2962.7711 2972.1854 2974.7351 2995.6980 2999.0838 3011.6092 3012.7109 3035.4860 3057.4231 3071.0151 3075.1020 3090.7682
redmass: 27.5411 25.4829 5.7243 6.2685 3.2420 2.1417 4.2150 16.7995 4.6742 3.4992 2.7911 2.6521 4.3762 3.3737 12.2040 32.0089 5.2661 11.2093 7.6173 1.2653 10.1252 11.8230 23.4200 5.4380 23.1008 20.5998 15.7785 8.5218 21.5065 8.1531 4.4859 4.0961 6.8757 13.4827 10.5030 13.0435 12.8808 1.0664 12.1471 8.1933 1.1404 11.9712 12.0365 12.3006 1.1555 12.5444 5.7511 1.2014 2.3901 8.8752 1.1526 7.1765 5.2233 8.1245 3.6051 2.6659 2.1360 2.8356 1.4183 10.8615 1.5250 1.2868 1.2915 1.1107 3.6509 1.0922 1.0989 1.6168 11.6478 1.5360 1.6787 1.7163 1.2157 4.3553 11.2582 1.2899 1.0864 1.1100 1.1974 1.0422 1.6659 1.3687 1.1507 1.0587 1.0591 1.0595 1.0361 1.0980 1.0600 1.1018 1.0565 1.1042 1.1041 1.1008 1.0993 1.1088
irintensity: 0.0158 0.0138 0.0304 0.0130 0.0542 0.0786 0.4743 0.1429 0.4920 1.3692 0.2555 0.3976 1.1363 1.2099 2.4077 0.0664 1.4422 0.7138 0.0807 0.0003 0.9119 0.5526 0.5258 1.2725 0.0110 2.4732 1.9029 0.8569 1.0318 0.5967 6.4019 1.6070 11.6504 0.4147 7.7252 154.4757 96.3944 11.4412 188.0269 150.1305 3.9197 0.5341 67.5876 19.4925 1.3992 3.1282 139.4909 1.0406 17.1994 4.8057 0.1744 29.1199 11.8118 9.1727 45.8259 19.9887 8.6682 3.2998 1.6868 19.4812 0.0116 0.2511 0.0401 0.0270 311.3686 0.1441 0.7783 23.2709 6.8734 75.9510 75.6583 61.1927 12.4808 112.5137 305.4777 86.1370 16.6449 23.3472 54.6566 12.9371 270.2371 112.6222 50.1092 0.2210 3.9618 87.3467 40.1446 0.7555 17.1381 0.3711 23.0781 40.7194 18.0755 86.8889 50.5372 47.3850
temp: 298.150 k
press: 1.00000 atm
elementType: 17 17 17 17 17 17 8 7 7 7 6 6 6 6 6 6 6 6 6 6 6 1 1 1 1 1 1 1 1 1 1 1 1 1
symmnumber: 1
zpe: 604980.8 jmol-1
zpe.correction: 0.230425 hartree
zpe.thermalcorrener: 0.252851 hartree
zpe.thermalcorrenthalpy: 0.253795 hartree
zpe.thermalcorrgfe: 0.175780 hartree
zpe.sumelectzpe: -3425.151560 hartree
zpe.sumelectthermal: -3425.129134 hartree
zpe.sumelectthermalent: -3425.128189 hartree
zpe.sumelectthermalfe: -3425.206205 hartree
dipole: -5.1370 0.5798 -0.0050
dipole: 5.1696
quadrupole: -157.8407 -176.4890 -161.7608
quadrupole: -0.0323 -0.0237 -0.0083
quadrupole: 7.5228 -11.1255 3.6027 -0.0323 -0.0237 -0.0083
hfenergy: -3425.3819847 hartree
pointgroup: C01 [X(C11H13Cl6N3O1)]
dipole: -2.017898 0.2545891 -0.0028502 debye
polarizability: 268.4162086|1.1563157|200.9575667|-0.1445068|-0.5645845|158.8897611 unknown
InChI: InChI=1S/C11H13Cl6N3O/c1-2-3-4-5-6-21-9-19-7(10(12,13)14)18-8(20-9)11(15,16)17/h2-6H2,1H3
charge 0 multiplicity 1
34 atoms
Cl 3.110739 3.055532 -1.56664
Cl 0.605093 3.764104 -0.045823
Cl 3.122428 3.085847 1.469365
Cl 4.68572 -1.625826 1.543049
Cl 3.125941 -3.718302 0.031313
Cl 4.707698 -1.653389 -1.494204
O  -1.02381 -1.001332 0.004983
N  1.228059 -1.478374 0.010059
N  0.456649 0.830732 -0.018556
N  2.820955 0.34517 -0.013543
C  -4.694243 0.085224 0.003805
C  -6.012501 -0.721579 0.013528
C  -3.444236 -0.827367 0.008078
C  -7.272044 0.174282 0.012121
C  -2.15779 -0.007605 -0.004821
C  -8.58457 -0.638536 0.018791
C  0.241017 -0.523958 -0.00146
C  2.483874 -0.980183 0.004171
C  1.762809 1.196167 -0.024831
C  2.106776 2.692426 -0.040926
C  3.664066 -1.961231 0.019474
H  -4.675759 0.742471 -0.890269
H  -4.671159 0.756534 0.887247
H  -6.039489 -1.392438 -0.870069
H  -6.033394 -1.381043 0.905818
H  -3.46154 -1.493933 -0.874792
H  -3.454849 -1.476227 0.904129
H  -7.245119 0.843161 0.896489
H  -7.24898 0.835057 -0.878434
H  -2.056217 0.617879 -0.909856
H  -2.05229 0.639878 0.884184
H  -9.469897 0.023087 0.016921
H  -8.650098 -1.293333 -0.870531
H  -8.646941 -1.283991 0.91513
