program: Gaussian 09
title: 000035557
version: EM64L-G09RevD.01
frameworkgroup: C1[X(C6N6S3)]
method: RPBEPBE
basis: SDD
operation: Freq
keyword: #p
keyword: freq=noraman
keyword: PBEPBE/SDD
title: #p freq=noraman PBEPBE/SDD
converged: NO YES NO NO
title: Mulliken charges:
elementType: S S S N N N N N N C C C C C C
charge: 0.427950 0.428481 0.435580 0.073414 0.105488 0.134939 0.061723 0.070694 0.070074 -0.296060 -0.287050 -0.277075 -0.315655 -0.315760 -0.316743
chargesum: 0.00000
title: Mulliken charges with hydrogens summed into heavy atoms:
polarizability: 2.58871249e+02 4.61787559e-02 1.73213929e+02 8.47543633e-04 5.31533982e-02 5.48683871e+01
1716.lowfreq: 0.0005 0.0019 0.0037 3.3737 5.0921 5.3226 31.3620 41.2200 55.4745
frequency: 31.3578 41.2195 55.4736 66.0014 74.8247 105.4254 128.8058 158.7419 165.5070 174.6684 202.9621 306.0152 344.8467 363.6770 372.0143 372.3209 372.9752 393.6648 457.6465 489.6516 529.6475 607.9569 611.4228 629.1589 630.0116 641.5431 769.3255 770.7677 790.5332 887.8295 1188.8510 1195.5345 1197.5677 1230.1918 1416.4412 1416.9889 2127.7830 2128.0632 2128.4259
redmass: 14.3788 16.2493 20.7999 14.0556 14.3714 15.2158 17.5127 14.4179 14.6339 17.7603 17.0948 18.7026 12.7371 14.3390 12.7727 12.7767 12.7703 17.0168 15.3269 16.2941 14.5556 12.3294 12.3506 18.2361 18.2902 18.3540 13.7859 13.8947 12.7818 13.9989 12.7710 12.5803 12.6916 12.1230 12.8749 12.8973 12.7491 12.7489 12.7489
irintensity: 1.5221 3.3835 0.2766 0.6184 2.4431 3.4901 1.7371 0.2158 0.2671 1.0424 0.7244 0.0009 0.2747 1.2301 0.0056 0.0498 0.0888 2.3199 2.0282 9.4482 2.1162 0.0006 0.0002 4.0722 8.0487 4.5634 161.0931 79.8325 2.4993 1.1677 112.6576 275.1595 229.2545 14.9038 705.4291 942.8215 1.6484 5.1449 3.8859
temp: 298.150 k
press: 1.00000 atm
elementType: 16 16 16 7 7 7 7 7 7 6 6 6 6 6 6
symmnumber: 1
zpe: 152977.5 jmol-1
zpe.correction: 0.058266 hartree
zpe.thermalcorrener: 0.073320 hartree
zpe.thermalcorrenthalpy: 0.074264 hartree
zpe.thermalcorrgfe: 0.013121 hartree
zpe.sumelectzpe: -1750.168554 hartree
zpe.sumelectthermal: -1750.153500 hartree
zpe.sumelectthermalent: -1750.152556 hartree
zpe.sumelectthermalfe: -1750.213699 hartree
dipole: -2.5481 -2.8933 -0.0119
dipole: 3.8554
quadrupole: -141.9505 -105.9740 -104.3799
quadrupole: 0.9800 0.0098 -0.0165
quadrupole: -24.5157 11.4608 13.0549 0.9800 0.0098 -0.0165
hfenergy: -1750.2268199 hartree
pointgroup: C01 [X(C6N6S3)]
dipole: 0.9747924 -1.158511 0.0919265 debye
dipolederiv: -0.6066518 -0.0312027 -0.0116005 0.0647669 0.2729171 -0.0046974 -0.0167185 -0.0065164 0.1757638 -0.3940027 -0.2886139 0.0062992 -0.3517417 0.108912 -0.0029873 0.0098505 -0.0017964 0.1747246 0.0792874 0.2766128 -0.0184404 0.3790447 -0.3311314 0.0378022 -0.0249104 0.0364469 0.1767186 -2.1644291 -0.3900521 -0.014582 -0.2698017 -0.6799073 0.0297521 -0.0232334 0.0262825 -0.1087708 -1.4026052 0.6408378 -0.0630864 0.8703698 -1.2550236 0.0850864 -0.076897 0.0825051 -0.0865251 -0.6969886 -0.4548011 0.0150836 -0.3426212 -1.7875892 0.0964297 0.0079566 0.0942788 -0.0586671 -0.2538177 0.003655 -0.0016849 -0.0804197 -0.0864643 -0.0056897 0.0034537 -0.0043351 -0.1590009 -0.2121391 -0.076749 0.0032329 -0.0365842 -0.0726777 -0.0052232 0.0009345 -0.0060866 -0.1491008 -0.1100947 0.094328 -0.0050693 0.0621794 -0.1727542 0.0026071 -0.0029972 0.003245 -0.1501215 2.394491 -0.0986936 0.0472491 -0.4007508 1.0183863 -0.0630566 0.0657502 -0.0577717 0.0680876 1.9157174 0.6004064 -0.0008219 0.6211316 1.3442389 -0.0634804 -0.0012057 -0.0639285 0.0782962 1.1023367 -0.2594192 0.0351672 -0.5473779 1.9950571 -0.1243088 0.0520527 -0.1192327 0.0925091 0.1154546 0.1592216 -0.0079732 0.2081994 -0.0859516 0.0074776 -0.0100263 0.0065678 -0.0169179 0.1642386 -0.0220882 0.0050733 -0.0411168 -0.1861931 0.0092339 0.0060336 0.0096101 -0.0185343 0.0692032 -0.153442 0.0111533 -0.1352776 -0.0818191 0.0010544 0.0099567 0.0007313 -0.0184615 unknown
polarizability: 258.7513722|-1.8626609|172.8322652|3.8636768|-7.1431913|55.3699282 unknown
InChI: InChI=1S/C6N6S3/c7-1-13-4-10-5(14-2-8)12-6(11-4)15-3-9
charge 0 multiplicity 1
15 atoms
S  3.33166 -1.490884 0.15181
S  -1.89346 -2.595349 0.119839
S  -0.160328 2.674478 -0.161102
N  0.661439 -1.783095 0.121467
N  1.41697 0.513195 -0.000543
N  -0.956264 0.016625 -0.017368
N  4.966038 0.952049 0.027021
N  -4.396638 -1.057248 -0.021172
N  -3.091895 2.907927 -0.232277
C  1.624147 -0.823602 0.083989
C  -0.606222 -1.293038 0.067323
C  0.102676 0.865989 -0.046876
C  4.255041 -0.008964 0.074679
C  -3.346864 -1.628475 0.033214
C  -1.9064 2.750393 -0.200103
