program: Gaussian 09
title: 000035582
version: EM64L-G09RevD.01
frameworkgroup: C1[X(C8H7Cl6N3O)]
method: RPBEPBE
basis: SDD
operation: Freq
keyword: #p
keyword: freq=noraman
keyword: PBEPBE/SDD
title: #p freq=noraman PBEPBE/SDD
converged: NO YES NO NO
title: Mulliken charges:
elementType: Cl Cl Cl Cl Cl Cl O N N N C C C C C C C C H H H H H H H
charge: 0.126168 0.132469 0.127217 0.119853 0.152342 0.121095 -0.195303 0.048703 -0.050145 0.093534 0.030681 -0.680103 -0.684919 0.039475 0.237031 0.295991 -0.774778 -0.776088 0.244687 0.214402 0.238262 0.232360 0.223549 0.252774 0.230744
chargesum: 0.00000
title: Mulliken charges with hydrogens summed into heavy atoms:
elementType: Cl Cl Cl Cl Cl Cl O N N N C C C C C C C C
charge: 0.126168 0.132469 0.127217 0.119853 0.152342 0.121095 -0.195303 0.048703 -0.050145 0.093534 0.275368 0.004921 0.022148 0.039475 0.237031 0.295991 -0.774778 -0.776088
polarizability: 1.96006348e+02 1.94866319e+01 1.90384512e+02 1.03229565e+00 -1.20582949e+00 1.36707600e+02
1716.lowfreq: -14.4327 -6.4886 -2.6447 -0.0016 0.0013 0.0014 3.7679 9.3132 47.5056
frequency: -13.4560 8.9769 47.5051 50.6360 71.8067 76.5682 84.2007 109.3557 152.0828 174.1646 178.8079 191.1916 195.2088 210.6029 216.8186 225.2288 246.0872 251.7392 278.6655 283.5071 307.7600 331.1453 344.0683 378.1289 390.1817 422.0312 432.0478 515.7429 608.0085 616.8476 649.8508 654.7744 720.6966 746.5207 761.6244 769.5623 781.9964 810.6621 838.9054 889.3362 901.9354 929.8229 940.8846 1005.7269 1028.6403 1090.1119 1158.0252 1173.7276 1192.0024 1283.5443 1308.1769 1314.0212 1332.4117 1384.5410 1400.5470 1414.8368 1431.9942 1456.3212 1464.3044 1472.6530 1479.0853 1487.1139 2994.2786 2998.7573 3043.3418 3090.6644 3099.5103 3104.0695 3109.4693
redmass: 21.5764 19.8513 2.9307 6.5228 7.6216 9.6701 6.3110 16.6839 21.7067 8.4059 24.1190 6.1755 1.0914 16.6421 2.3091 14.8125 1.8431 25.1432 24.2526 4.7556 18.7360 6.2179 6.0749 11.7952 9.7992 6.2342 2.9919 4.8853 13.4800 9.0273 13.0697 12.6266 7.4136 12.3160 9.6985 12.1881 11.3524 7.8432 12.5948 3.1480 7.8312 1.2210 1.3465 11.0039 12.9386 1.6428 2.1220 3.5090 2.9171 3.7473 11.8623 1.7809 1.4709 1.2616 1.2308 7.3885 10.9930 1.0558 1.0599 1.1812 3.9642 1.1055 1.0358 1.0361 1.0873 1.0990 1.0988 1.1013 1.1007
irintensity: 0.0031 0.0006 0.6714 0.0488 1.3351 0.7669 0.9702 0.0183 1.1048 1.2883 0.0100 2.3256 0.2377 0.1294 0.1871 0.2039 1.1521 0.4769 0.0518 2.1478 1.0919 0.7130 1.5330 1.2370 1.4694 3.7116 3.4467 11.6631 0.5036 8.9756 150.9257 95.4974 66.5767 154.8615 140.7373 0.7956 54.9995 94.3228 3.3906 43.5469 4.6216 2.8183 0.3664 49.4279 19.4075 115.5692 10.6183 12.5963 40.0994 320.6380 5.6492 32.5967 5.3871 39.0926 40.2336 171.4229 300.5889 6.3945 8.2715 49.4080 457.7104 64.2379 10.2268 16.8636 3.1928 7.4998 32.2371 12.1671 31.3572
temp: 298.150 k
press: 1.00000 atm
elementType: 17 17 17 17 17 17 8 7 7 7 6 6 6 6 6 6 6 6 1 1 1 1 1 1 1
symmnumber: 1
zpe: 383484.3 jmol-1
zpe.correction: 0.146061 hartree
zpe.thermalcorrener: 0.165215 hartree
zpe.thermalcorrenthalpy: 0.166159 hartree
zpe.thermalcorrgfe: 0.095469 hartree
zpe.sumelectzpe: -3307.489416 hartree
zpe.sumelectthermal: -3307.470262 hartree
zpe.sumelectthermalent: -3307.469318 hartree
zpe.sumelectthermalfe: -3307.540009 hartree
dipole: 4.2214 2.6741 -0.0146
dipole: 4.9972
quadrupole: -140.7937 -146.3297 -142.3658
quadrupole: 12.8664 0.0778 -0.1889
quadrupole: 2.3694 -3.1666 0.7972 12.8664 0.0778 -0.1889
hfenergy: -3307.6354772 hartree
pointgroup: C01 [X(C8H7Cl6N3O1)]
dipole: -1.9330252 0.3472513 0.0901176 debye
dipolederiv: -0.2476504 0.0736367 -0.2483118 0.0692054 -0.2745447 0.1671459 -0.2385289 0.128859 -0.5437677 -0.6631092 -0.1296333 0.0398257 -0.151967 -0.1518129 0.0128375 0.040567 0.0129453 -0.1291533 -0.1955315 0.092835 0.1950148 0.0830699 -0.3228322 -0.2100743 0.1868597 -0.1728286 -0.5308818 -0.3058988 0.040742 0.214447 0.043594 -0.2331876 -0.2070276 0.1704318 -0.202407 -0.5564575 -0.1020943 -0.0400789 0.0011247 -0.0133816 -0.6834106 0.0441777 0.0000756 0.0485386 -0.1148409 -0.3837424 0.0367863 -0.2639126 0.0475861 -0.1775611 0.1446444 -0.2164378 0.141642 -0.5298868 -1.8510754 0.6259478 0.0049361 0.7454467 -0.6440852 -0.0490798 0.1089825 -0.0906476 -0.3298375 -1.3788924 0.3816433 0.0484797 0.0162239 -0.4525176 0.0213054 0.1056908 -0.008859 -0.1828668 -0.7376721 0.1068238 0.0350724 0.7571432 -1.0445357 0.0337673 -0.0255651 0.0649973 -0.1602394 -0.8647914 -0.4831813 0.0992028 -0.4379133 -1.0874284 0.1282573 0.1094495 0.1204652 -0.0881095 1.3098192 -0.3315538 -0.0077463 0.0794716 0.236451 0.0684405 -0.0991079 0.1285011 0.3799096 -0.1033266 0.0909946 0.0200031 0.0482305 -0.0180038 -0.0823503 0.0369325 -0.0771209 -0.0026878 -0.1521746 0.0671048 -0.0223118 -0.0608562 0.0186106 -0.0852543 -0.0172054 -0.1228073 -0.1259987 1.894585 -0.7172808 -0.0179499 -1.2247945 1.0594018 -0.0028468 -0.0389558 0.0036733 0.3032138 1.09415 0.1381853 -0.103364 0.1466772 0.7182275 -0.082594 -0.1208394 -0.0711791 -0.0117604 0.7153167 0.1197479 -0.0663125 -0.0780647 1.0869822 -0.1008251 -0.0576502 -0.1069188 -0.0093118 1.2224243 0.0603019 -0.0017208 0.0125483 0.627668 0.0477524 0.0032696 0.0478501 1.2496774 0.6644068 -0.1159965 0.0712887 -0.0449521 1.2344828 0.0089132 0.0640313 0.0127522 1.2507133 -0.0330259 0.0561252 -0.0378382 -0.0498759 -0.0084885 0.0698688 -0.0213717 0.0561008 -0.0247661 -0.1360914 -0.0265237 0.039536 -0.0624665 0.0512281 0.006981 0.0265588 -0.0045488 0.1099274 0.0966768 -0.0373389 -0.0926403 0.003522 0.0614689 -0.0622972 -0.070666 -0.0628243 -0.0792134 0.1187415 -0.0193575 0.0183608 0.0392507 -0.0337248 0.0704456 -0.0045428 0.1276898 -0.0058064 -0.145386 -0.0413054 0.0095741 -0.0799211 0.1082799 0.0080208 -0.0039916 0.0317135 0.0846897 0.0661702 0.0838439 0.0595021 0.0933871 -0.0272333 -0.0703476 0.0726426 -0.0666185 0.0473983 0.1181719 -0.0324684 0.0057404 0.0188362 -0.0434342 0.1201393 -0.0106292 0.0610317 0.0000559 unknown
polarizability: 208.7481027|-11.988076|177.5343242|-2.7286703|-1.2375291|136.8160336 unknown
InChI: InChI=1S/C8H7Cl6N3O/c1-3(2)18-6-16-4(7(9,10)11)15-5(17-6)8(12,13)14/h3H,1-2H3
charge 0 multiplicity 1
25 atoms
Cl 0.768175 -3.256367 1.846134
Cl -1.913453 -3.207961 0.467096
Cl 0.597396 -3.508367 -1.17403
Cl 3.552865 0.409305 -1.786107
Cl 2.886086 3.00109 -0.395763
Cl 3.835867 0.644619 1.227828
O  -1.900422 1.817076 0.127195
N  0.373083 1.518292 -0.060128
N  -1.097736 -0.399301 0.217872
N  1.287745 -0.721374 0.050356
C  -3.320851 1.271847 0.290634
C  -4.100937 2.439324 0.891141
C  -3.820029 0.807819 -1.081429
C  -0.867846 0.94797 0.093061
C  1.396106 0.636292 -0.075019
C  0.014717 -1.172822 0.191898
C  -0.146122 -2.693773 0.325162
C  2.824471 1.170339 -0.247261
H  -3.251319 0.417012 0.987026
H  -5.147126 2.131052 1.067079
H  -3.664173 2.755437 1.853301
H  -4.101649 3.304534 0.206173
H  -4.869335 0.472311 -0.995161
H  -3.222843 -0.039531 -1.457219
H  -3.78027 1.635576 -1.810739
