program: Gaussian 09
title: 000035589
version: EM64L-G09RevD.01
frameworkgroup: C1[X(C11H7Cl4N3O)]
method: RPBEPBE
basis: SDD
operation: Freq
keyword: #p
keyword: freq=noraman
keyword: PBEPBE/SDD
title: #p freq=noraman PBEPBE/SDD
converged: YES YES NO NO
title: Mulliken charges:
elementType: Cl Cl Cl Cl O N N N C C C C C C C C C C C H H H H H H H
charge: 0.116349 0.131911 0.104176 -0.037658 -0.196068 0.000163 -0.013317 -0.047682 0.303282 -0.033745 -0.331668 -0.327970 0.274795 -0.210387 -0.210254 0.009240 -0.101380 -0.770225 -0.499138 0.288979 0.288839 0.262069 0.261724 0.248376 0.241210 0.248378
chargesum: 0.00000
title: Mulliken charges with hydrogens summed into heavy atoms:
elementType: Cl Cl Cl Cl O N N N C C C C C C C C C C C
charge: 0.116349 0.131911 0.104176 -0.037658 -0.196068 0.000163 -0.013317 -0.047682 0.303282 -0.033745 -0.042689 -0.039131 0.274795 0.051681 0.051470 0.009240 -0.101380 -0.770225 0.238826
polarizability: 3.10547467e+02 3.41674925e+01 1.94255277e+02 -3.17130103e-01 3.15252296e-01 9.99626257e+01
1716.lowfreq: -1.3249 -0.0004 0.0018 0.0021 3.2087 8.3689 13.5057 40.9239 48.4796
frequency: 12.1524 40.8998 48.4399 58.8434 87.6407 103.7431 118.2111 122.8488 158.6805 168.2343 184.6564 212.2722 219.7780 235.2905 261.8873 270.7485 282.4193 313.0331 349.8478 374.1624 409.8705 411.6535 478.0201 482.7681 535.7980 613.5297 622.4828 623.5302 668.8999 682.0284 722.1163 736.7407 755.8530 763.5726 825.8743 843.1058 847.3694 862.9443 904.5173 946.9686 990.7603 995.1910 999.3716 1022.7089 1069.5978 1104.5317 1112.9210 1113.4322 1148.3977 1178.0809 1214.3021 1277.4799 1294.4748 1321.5568 1375.1414 1397.5991 1400.0617 1427.1413 1451.8152 1452.6861 1458.7880 1484.0562 1492.6628 1577.7224 1600.6050 3013.2735 3120.8018 3157.8144 3162.4019 3162.7394 3178.4336 3182.1604
redmass: 20.2851 8.1192 4.0477 15.1256 7.5613 2.9125 4.9546 1.4488 8.4385 9.0484 16.5899 6.4361 15.5735 13.0519 6.6303 11.3122 14.3512 9.5246 7.1085 17.6601 7.1335 2.9490 9.3336 3.3628 8.9950 7.3390 11.0355 7.1935 9.8101 5.6718 8.8846 5.8027 10.6945 6.6438 4.5393 1.2442 8.6960 1.9844 13.6722 10.2338 1.3565 1.3560 4.1861 7.1166 2.9773 1.6768 2.7319 1.2535 1.5559 1.1480 6.7448 3.9719 1.5354 4.9991 5.0808 2.6882 4.4037 6.5337 1.6137 1.0527 1.2409 4.5704 3.8058 8.0423 6.3115 1.0290 1.1051 1.1057 1.0889 1.0889 1.0968 1.0981
irintensity: 0.0081 0.0410 0.3029 0.1091 0.4235 5.3883 1.1802 1.1275 0.1551 4.5607 0.6491 2.0619 0.2466 0.8208 7.0880 0.0339 0.1220 0.6438 0.4586 0.1256 2.8334 0.0155 35.9605 27.1123 5.7686 35.7651 56.5549 0.6582 27.2512 8.4672 60.4606 13.8892 124.8847 116.9977 16.3300 0.0367 16.8944 34.4607 10.2514 31.3247 1.3710 0.0655 75.3138 42.8463 72.4913 10.3266 1.0660 0.0551 5.6247 67.6445 62.3519 18.0086 1.8637 516.2854 61.2812 106.5310 9.0477 231.5433 214.7983 18.0851 119.7034 875.2647 40.4513 8.0870 134.6789 33.5063 18.9103 19.0883 0.3106 0.2530 1.2419 5.2825
temp: 298.150 k
press: 1.00000 atm
elementType: 17 17 17 17 8 7 7 7 6 6 6 6 6 6 6 6 6 6 6 1 1 1 1 1 1 1
symmnumber: 1
zpe: 426469.6 jmol-1
zpe.correction: 0.162434 hartree
zpe.thermalcorrener: 0.180564 hartree
zpe.thermalcorrenthalpy: 0.181509 hartree
zpe.thermalcorrgfe: 0.112908 hartree
zpe.sumelectzpe: -2501.709222 hartree
zpe.sumelectthermal: -2501.691091 hartree
zpe.sumelectthermalent: -2501.690147 hartree
zpe.sumelectthermalfe: -2501.758747 hartree
dipole: 0.9566 2.2044 -0.0768
dipole: 2.4042
quadrupole: -137.8812 -128.9321 -137.4113
quadrupole: 11.1734 -0.2100 0.1702
quadrupole: -3.1397 5.8094 -2.6697 11.1734 -0.2100 0.1702
hfenergy: -2501.8716557 hartree
pointgroup: C01 [X(C11H7Cl4N3O1)]
dipole: -0.4490418 0.8293019 0.0731322 debye
dipolederiv: -0.2021958 0.0698489 -0.1216219 0.0014224 -0.424839 0.3078315 -0.108897 0.2481052 -0.4518991 -0.7183956 0.1348709 0.0742488 0.1090328 -0.1400658 -0.0160125 0.0601482 -0.0208278 -0.1373827 -0.2067656 -0.0190837 0.0787826 -0.0897048 -0.2860835 -0.2389079 0.0387533 -0.1992314 -0.6793032 -1.1099379 0.1228703 -0.0158825 0.1362078 -0.1299795 -0.0013627 -0.0133959 -0.0018401 -0.0583286 -0.9429398 0.5727593 0.0201502 0.9995406 -1.3507852 -0.0416743 0.0446484 -0.0468735 -0.3129625 -1.7950817 -0.2564676 -0.0702886 -0.5139289 -0.609441 -0.0440448 -0.0529735 -0.038963 -0.107455 -1.5365112 0.5928324 0.0038437 0.679805 -0.8310621 -0.0263685 0.0101063 -0.0267437 -0.2005679 -0.6874232 -0.2147574 -0.0216398 0.3459014 -1.2618446 -0.0711629 0.0014933 -0.0634691 -0.1513403 -1.0459007 0.1205715 -0.0165073 0.1083528 -0.0862613 -0.0002951 -0.0123831 0.0020599 -0.042951 2.4635316 -0.18625 0.0473654 -0.2061751 0.7515318 0.0397176 0.0273358 0.0327507 0.1144575 0.2934006 0.0518797 0.0116496 -0.3742014 0.0447602 -0.0000302 -0.0160451 0.0078952 -0.0889783 0.348297 -0.1372478 0.0017665 0.2979715 -0.0030197 0.0123724 0.0275279 0.0024799 -0.0942648 1.1497694 0.2232227 0.0572284 0.1131669 0.8978733 0.0787991 0.0934003 0.118244 -0.0302211 -0.6342695 -0.0931653 -0.0176109 -0.2331114 0.0282835 0.0021709 -0.024426 0.0060982 -0.1051531 -0.5167253 0.227515 0.0041184 0.3850622 -0.0889575 0.0098377 0.0145225 0.0056726 -0.1073197 1.3043854 -0.5434867 -0.008616 -1.1120106 1.9249843 0.0792909 -0.0443014 0.0783226 0.2908492 1.5665858 -0.1699638 0.0246919 -0.1973104 0.2545054 0.0140352 0.0209788 0.0148357 -0.0494706 1.203792 -0.2124515 -0.0408326 -0.1626914 0.7603521 -0.0769175 -0.0542844 -0.0901888 1.2964067 0.7429474 -0.4148262 -0.013503 -0.2253005 0.4145671 0.0045669 0.000391 -0.0016318 0.2509971 0.1178841 -0.0671047 -0.0036102 -0.0618916 0.0499756 -0.0064654 -0.0045655 -0.0059626 0.1410717 0.1390261 0.0518654 0.0031934 0.0328499 0.0277821 -0.0066303 0.0016395 -0.0061852 0.1511464 0.0524553 0.0516193 0.0008529 0.0598137 -0.0085969 -0.0088005 0.0012088 -0.0088829 0.1624 0.016844 -0.0642814 -0.0070419 -0.0666731 0.0241196 -0.0098576 -0.0070478 -0.0097075 0.1637995 -0.0323375 0.075874 -0.0273477 -0.052839 0.0937258 -0.0803468 -0.0590057 -0.0510333 -0.0530464 0.0662733 0.0146024 -0.0007393 0.0912077 -0.1275623 -0.0140778 0.0038395 -0.0152718 0.1282107 -0.0367084 0.0687542 0.0373497 -0.0644962 0.0760375 0.0943328 0.0513321 0.0703483 -0.0286945 unknown
polarizability: 315.3582588|-24.1335423|189.0684612|3.5221917|4.8670826|100.3386494 unknown
InChI: InChI=1S/C11H7Cl4N3O/c1-19-10-17-8(6-2-4-7(12)5-3-6)16-9(18-10)11(13,14)15/h2-5H,1H3
charge 0 multiplicity 1
26 atoms
Cl -2.355555 -3.024726 1.05789
Cl -4.61649 -1.35526 -0.022471
Cl -2.573841 -2.507593 -1.924853
Cl 6.258565 -0.491415 0.068772
O  -2.104735 3.004884 0.098881
N  -0.589916 -0.777842 -0.092305
N  -0.265803 1.620706 0.061053
N  -2.509431 0.689075 -0.049092
C  1.67951 0.138051 0.012244
C  0.21839 0.33976 -0.006907
C  2.220145 -1.174918 -0.054626
C  2.55273 1.256277 0.09768
C  -1.920732 -0.533294 -0.105886
C  3.614336 -1.372432 -0.037676
C  3.948044 1.070131 0.115354
C  -1.620286 1.731965 0.034587
C  4.457273 -0.244294 0.046936
C  -2.829495 -1.765787 -0.226663
C  -3.581426 3.175004 0.073245
H  1.535232 -2.025066 -0.119262
H  2.120949 2.259863 0.148979
H  4.039101 -2.37871 -0.088661
H  4.627643 1.924242 0.180429
H  -3.996763 2.768918 -0.863165
H  -3.721863 4.262538 0.137051
H  -4.040584 2.657721 0.931067
