program: Gaussian 09
title: 000035563
version: EM64L-G09RevD.01
frameworkgroup: C1[X(C9H9N3O6)]
method: RPBEPBE
basis: SDD
operation: Freq
keyword: #pfreq=noraman
keyword: PBEPBE/SDD
title: #p freq=noraman PBEPBE/SDD
converged: NO NO NO NO
title: Mulliken charges:
elementType: O O O O O O N N N C C C C C C C C C H H H H H H H H H
charge: -0.225926 -0.227226 -0.224709 -0.185200 -0.182299 -0.183406 0.099493 0.091265 0.083422 -0.115333 -0.111791 -0.109277 0.187605 0.190303 0.193301 -0.498171 -0.498221 -0.497513 0.246921 0.246924 0.243613 0.247323 0.242878 0.247326 0.246621 0.246628 0.245445
chargesum: 0.00000
title: Mulliken charges with hydrogens summed into heavy atoms:
elementType: O O O O O O N N N C C C C C C C C C
charge: -0.225926 -0.227226 -0.224709 -0.185200 -0.182299 -0.183406 0.099493 0.091265 0.083422 -0.115333 -0.111791 -0.109277 0.187605 0.190303 0.193301 0.239288 0.239306 0.241182
polarizability: 1.89433681e+02 1.54229192e-01 1.67366537e+02 -1.04254422e-03 1.88287836e-02 7.08460343e+01
1716.lowfreq: -26.7164 -20.0237 -18.3609 0.0004 0.0011 0.0011 5.9977 8.4636 9.5497
frequency: -26.6896 -19.9581 -18.1072 68.0390 82.2278 88.8480 91.1413 96.8560 101.6171 112.1637 116.5579 173.2265 177.5133 181.7214 200.3551 244.2227 264.0775 291.4734 311.5362 325.6487 350.7984 441.7437 464.9984 499.2658 505.7821 579.9617 655.9609 696.3829 697.7326 748.9563 781.9705 785.0597 809.8277 834.8965 856.8257 899.3750 915.0456 947.1583 962.6024 1114.4434 1114.5881 1114.7641 1116.0004 1129.7672 1144.9162 1151.0068 1154.1358 1156.1926 1162.4993 1284.4181 1294.4108 1355.6090 1422.9864 1423.6871 1426.0785 1440.4854 1445.6268 1452.4569 1453.1280 1453.7765 1460.2481 1460.7336 1461.1115 1629.4633 1632.9295 1637.4300 3001.9478 3002.2001 3002.4646 3101.6775 3101.9685 3102.1402 3155.9507 3156.2406 3156.4793
redmass: 7.8053 7.8035 6.4588 4.0385 4.5495 4.8283 1.1876 3.4283 3.8418 1.1344 1.1377 5.2811 4.7966 5.5535 5.3143 6.5991 4.9742 4.6210 5.3363 6.3058 12.8454 9.1532 12.6828 11.2906 11.1510 11.4394 11.7370 7.7190 7.3990 6.1420 12.0712 12.1047 8.0860 8.6133 12.6502 12.8442 9.5391 9.2539 9.5366 1.2664 1.2669 1.2669 4.9825 5.3822 2.0552 8.6463 1.5854 1.7831 3.4078 10.2945 10.4039 7.3107 1.1942 1.1963 1.2317 10.5705 12.1119 1.0490 1.0485 1.0485 1.0552 1.0541 1.0525 10.4269 10.4868 10.5461 1.0302 1.0302 1.0302 1.1042 1.1042 1.1042 1.1045 1.1045 1.1045
irintensity: 0.6078 2.0975 2.8647 2.2068 0.5151 3.7206 0.0367 0.0008 0.0001 0.0892 0.0791 0.0517 0.1521 0.1825 22.3166 2.5014 25.8652 6.2541 14.8693 5.0336 2.1235 3.3031 0.3476 0.0007 0.0007 0.1110 26.1675 46.2758 55.3335 4.8906 0.0000 0.0003 10.8654 1.6768 2.1022 0.2110 3.0941 18.3265 61.9449 0.0153 0.0062 0.0320 11.5249 131.8504 111.5383 8.1591 13.4631 60.3838 555.8418 62.8958 11.1201 44.4584 19.3825 31.1993 0.4091 122.7509 113.8747 16.5220 9.2320 23.2085 11.3343 4.8390 13.9491 3.1549 189.4235 209.3674 29.8784 30.5698 17.2048 15.2656 20.3819 31.9224 8.4989 15.2899 11.2916
temp: 298.150 k
press: 1.00000 atm
elementType: 8 8 8 8 8 8 7 7 7 6 6 6 6 6 6 6 6 6 1 1 1 1 1 1 1 1 1
symmnumber: 1
zpe: 479915.1 jmol-1
zpe.correction: 0.182790 hartree
zpe.thermalcorrener: 0.198968 hartree
zpe.thermalcorrenthalpy: 0.199913 hartree
zpe.thermalcorrgfe: 0.138186 hartree
zpe.sumelectzpe: -962.566387 hartree
zpe.sumelectthermal: -962.550209 hartree
zpe.sumelectthermalent: -962.549265 hartree
zpe.sumelectthermalfe: -962.610991 hartree
dipole: 2.5477 2.6567 0.0052
dipole: 3.6809
quadrupole: -70.4196 -111.4631 -97.6948
quadrupole: -0.2935 -0.0156 0.0034
quadrupole: 22.7729 -18.2706 -4.5023 -0.2935 -0.0156 0.0034
hfenergy: -962.7491775 hartree
pointgroup: C01 [X(C9H9N3O6)]
dipole: -1.014616 -1.0333357 0.0020397 debye
polarizability: 189.4342496|-0.1060203|167.3659688|0.0008204|-0.0188398|70.8460343 unknown
InChI: InChI=1S/C9H9N3O6/c1-16-7(13)4-10-5(8(14)17-2)12-6(11-4)9(15)18-3/h1-3H3
charge 0 multiplicity 1
27 atoms
O  -1.965414 -2.861058 0.001901
O  -3.172606 1.614196 0.00053
O  3.684437 -0.216374 0.002538
O  0.24926 -3.591828 -0.000741
O  -1.626801 3.360853 0.000508
O  3.217346 2.069171 -0.000714
N  -1.258393 -0.269104 0.000267
N  1.088788 -0.89389 0.000273
N  0.457007 1.449848 0.000216
C  -0.246401 -1.189127 0.000179
C  -0.845785 1.035253 0.00019
C  1.381129 0.441955 0.000172
C  -0.59488 -2.671491 0.000165
C  -1.892794 2.14112 0.00054
C  2.840206 0.878895 0.000375
C  -2.405527 -4.276472 0.002249
C  -4.26516 2.615864 0.000676
C  5.131948 0.101714 0.003075
H  -2.025363 -4.793838 0.899877
H  -2.027619 -4.793561 -0.896488
H  -3.502624 -4.225897 0.003636
H  -4.197833 3.253621 0.898842
H  -5.18789 2.0202 0.000662
H  -4.197932 3.253803 -0.897368
H  5.392856 0.688204 0.900825
H  5.39404 0.685806 -0.895898
H  5.630605 -0.87676 0.004713
