program: Gaussian 09
title: 000035595
version: EM64L-G09RevD.01
frameworkgroup: C1[X(C9H13N3O6)]
method: RPBEPBE
basis: SDD
operation: Freq
keyword: #p
keyword: freq=noraman
keyword: PBEPBE/SDD
title: #p freq=noraman PBEPBE/SDD
converged: YES YES NO NO
title: Mulliken charges:
elementType: O O O O O O N N N C C C C C C C C C H H H H H H H H H H H H H
charge: -0.298163 -0.489743 -0.455835 -0.441106 -0.495650 -0.343324 -0.401946 -0.055629 -0.612740 -0.206309 -0.160998 -0.103804 0.010627 0.268840 -0.370129 0.029655 -0.109239 0.241102 0.237321 0.222880 0.258002 0.272483 0.199461 0.199643 0.410918 0.377689 0.364264 0.346017 0.409800 0.354284 0.341628
chargesum: 0.00000
title: Mulliken charges with hydrogens summed into heavy atoms:
elementType: O O O O O O N N N C C C C C C C C C
charge: -0.298163 -0.078825 -0.078146 -0.095089 -0.085850 -0.343324 -0.037682 -0.055629 0.083172 0.031011 0.061882 0.154198 0.283111 0.268840 0.028975 0.029655 -0.109239 0.241102
polarizability: 1.91476781e+02 2.41786863e+00 1.40366628e+02 -5.33028054e+00 2.35361382e+00 8.39697045e+01
1716.lowfreq: -7.7109 -4.0783 -0.0004 -0.0001 0.0003 5.8139 28.9351 42.6129 55.6945
frequency: 28.5108 42.5749 55.6693 78.3420 98.3764 106.0424 126.2459 160.7190 195.0239 211.2679 230.3362 252.8492 267.9136 286.0663 308.2554 318.2695 339.8554 353.3608 400.3310 458.6814 477.2351 522.5545 540.2195 555.1679 585.3219 596.3537 599.8040 629.6684 643.0139 649.4706 671.3524 700.2523 711.4957 718.6293 769.3121 819.6377 832.3549 853.0387 889.7032 966.7045 973.6481 995.3873 1001.5817 1026.8888 1031.5283 1058.9870 1064.5443 1067.7742 1103.4097 1126.3491 1177.0962 1190.5524 1209.2495 1225.7305 1240.1635 1245.7175 1265.6417 1278.8947 1296.2356 1306.8187 1316.7908 1325.4331 1343.0458 1364.4382 1381.3643 1401.7961 1409.6062 1421.0689 1458.9266 1484.5037 1525.6169 1546.7400 1614.8392 1654.3959 2938.2604 2949.0211 2979.0658 2988.7371 2994.5027 3002.2919 3042.3823 3341.9281 3456.1280 3517.6857 3572.2969 3597.2019 3674.2988
redmass: 6.0079 6.5511 6.6232 6.3868 4.9556 4.7914 8.7714 4.7064 5.2710 3.4481 1.3134 6.3388 4.8528 5.1682 4.2166 5.8493 6.2876 5.1935 4.6428 4.3050 2.3035 1.6086 6.3880 1.4771 3.9707 2.0098 1.6517 3.4138 1.1679 3.8116 5.8912 5.3233 1.2282 5.4553 8.3468 3.8808 1.0914 4.7440 3.9122 6.6139 5.9946 3.3209 2.2591 4.9252 4.1375 3.7269 2.5489 2.1025 2.3129 4.7214 1.2738 3.3546 1.0907 1.2779 1.2061 1.3263 1.1789 1.8129 1.7714 1.6955 1.3808 1.2420 1.8160 1.7986 1.6044 1.7642 1.5117 1.5973 1.0803 5.7213 6.2770 3.3426 1.6770 4.3530 1.0551 1.0814 1.0856 1.0666 1.1044 1.0871 1.0869 1.0679 1.0645 1.0450 1.0666 1.0827 1.1051
irintensity: 0.3508 3.7683 3.3923 8.8921 2.6026 11.2072 6.8417 9.7792 5.6008 32.1507 119.0984 13.6337 14.1477 0.7050 14.8505 0.9044 2.8314 2.9771 1.3026 49.7519 51.8042 128.9679 6.7659 67.1422 12.5053 88.4012 117.3941 26.6602 97.3314 15.4321 5.6542 20.7017 116.8575 41.9862 0.9192 28.7733 192.2874 9.1959 29.9831 131.4882 53.6844 20.2910 34.3682 27.9235 20.2704 74.5116 6.0329 2.8920 13.0937 51.4908 10.2430 49.1422 8.1141 37.6014 22.7380 53.6399 5.0211 28.5888 131.6686 76.7785 10.0428 37.2266 28.9742 43.2705 54.4739 25.1913 216.6089 5.8378 7.4430 68.6031 134.7478 44.9506 284.0159 105.7840 46.3270 14.4030 31.7767 470.1116 41.0383 73.5616 29.2751 287.1359 35.8654 80.1753 4.0318 126.5504 56.0124
temp: 298.150 k
press: 1.00000 atm
elementType: 8 8 8 8 8 8 7 7 7 6 6 6 6 6 6 6 6 6 1 1 1 1 1 1 1 1 1 1 1 1 1
symmnumber: 1
zpe: 617503.6 jmol-1
zpe.correction: 0.235195 hartree
zpe.thermalcorrener: 0.252374 hartree
zpe.thermalcorrenthalpy: 0.253318 hartree
zpe.thermalcorrgfe: 0.189480 hartree
zpe.sumelectzpe: -964.955102 hartree
zpe.sumelectthermal: -964.937922 hartree
zpe.sumelectthermalent: -964.936978 hartree
zpe.sumelectthermalfe: -965.000817 hartree
dipole: -1.5979 -3.3577 2.6280
dipole: 4.5534
quadrupole: -91.4686 -106.0410 -103.2122
quadrupole: 5.0064 13.0564 -4.4983
quadrupole: 8.7720 -5.8004 -2.9716 5.0064 13.0564 -4.4983
hfenergy: -965.1902965 hartree
pointgroup: C01 [X(C9H13N3O6)]
dipole: 0.9898867 1.4688021 -0.2684703 debye
polarizability: 190.0634707|-9.3758393|105.3145959|3.8627422|-28.027775|120.4350469 unknown
InChI: InChI=1S/C9H13N3O6/c10-9(17)4-6(15)3(11-12-4)8-7(16)5(14)2(1-13)18-8/h2,5,7-8,11,13-16H,1,10H2
charge 0 multiplicity 1
31 atoms
O  -1.611617 0.492676 -1.072014
O  -1.430036 -1.38962 2.093871
O  -3.738897 -1.297923 0.803411
O  -3.594573 2.425636 -2.03472
O  1.362491 -1.50719 1.747696
O  4.026473 -1.372368 1.729704
N  1.195555 0.245314 -1.363598
N  2.567601 0.245072 -1.225958
N  5.192301 -0.331054 -0.014452
C  -1.53539 -0.267248 1.180855
C  -3.033134 -0.02055 0.856769
C  -0.962304 -0.53414 -0.237362
C  -3.024676 0.603467 -0.568283
C  0.51785 -0.380041 -0.325815
C  -3.448421 2.065722 -0.619511
C  1.519166 -0.82582 0.546437
C  2.760077 -0.43065 -0.039377
C  4.041601 -0.73491 0.604964
H  -1.069477 0.649169 1.596106
H  -3.503448 0.644604 1.608523
H  -1.284996 -1.550356 -0.553989
H  -3.681671 -0.001581 -1.21986
H  -2.684713 2.696159 -0.115671
H  -4.417283 2.166933 -0.08355
H  -0.460559 -1.607257 2.229906
H  -3.299783 -1.884144 1.48172
H  0.753464 0.72541 -2.147435
H  -3.822454 3.385943 -2.109507
H  2.316499 -1.660403 2.090281
H  5.14047 0.168502 -0.902548
H  6.093384 -0.532954 0.415906
