program: Gaussian 09
title: 000035587
version: EM64L-G09RevD.01
frameworkgroup: C1[X(C11H8Cl3N3O)]
method: RPBEPBE
basis: SDD
operation: Freq
keyword: #p
keyword: freq=noraman
keyword: PBEPBE/SDD
title: #p freq=noraman PBEPBE/SDD
converged: YES YES NO NO
title: Mulliken charges:
elementType: Cl Cl Cl O N N N C C C C C C C C C C C H H H H H H H H
charge: 0.114338 0.129095 0.102370 -0.197222 0.001263 -0.011782 -0.049538 0.284106 -0.030748 -0.341659 -0.338562 0.272092 0.006712 -0.229344 -0.227091 -0.768256 -0.220699 -0.499625 0.283583 0.283095 0.234420 0.233981 0.234102 0.240025 0.247704 0.247641
chargesum: 0.00000
title: Mulliken charges with hydrogens summed into heavy atoms:
elementType: Cl Cl Cl O N N N C C C C C C C C C C C
charge: 0.114338 0.129095 0.102370 -0.197222 0.001263 -0.011782 -0.049538 0.284106 -0.030748 -0.058076 -0.055467 0.272092 0.006712 0.005076 0.006890 -0.768256 0.013404 0.235745
polarizability: 2.57842090e+02 3.23207234e+01 1.96949152e+02 -4.51817113e-01 4.23443348e-01 9.75126212e+01
1716.lowfreq: -8.8282 -0.0033 -0.0031 -0.0023 2.9324 4.4344 11.2687 43.5403 59.2312
frequency: 7.9890 43.5313 59.2260 73.8825 92.9643 124.7574 127.8107 132.7736 173.5454 198.7725 204.9261 219.7695 236.8627 256.5017 289.3313 294.0957 334.5996 375.8014 404.1347 428.4903 457.5718 534.6140 609.2655 616.9020 623.0962 633.6006 687.0692 707.4381 711.5211 751.4452 754.7721 794.1030 839.9516 847.7971 868.3288 904.1518 947.5656 963.9267 989.6135 1003.8516 1014.1199 1018.6183 1024.0522 1081.0100 1111.7299 1113.2716 1148.5980 1174.5896 1182.2701 1213.0877 1277.8074 1317.0793 1321.1207 1391.2298 1397.6992 1413.3547 1446.4180 1452.7622 1453.1632 1459.7556 1485.4758 1494.7391 1586.2459 1612.5128 3012.3598 3119.6282 3131.6239 3145.2001 3157.0980 3158.3600 3170.5841 3176.7547
redmass: 15.9839 4.0448 5.6825 8.4987 5.4839 5.2104 4.6952 1.2162 10.0786 5.2452 11.2354 17.4290 6.4856 10.0226 6.0913 17.8257 7.8967 21.1376 2.8565 7.6956 3.7222 9.3258 7.0327 6.6729 11.3566 8.5158 4.4645 1.8493 9.3699 7.3268 8.6177 2.8855 6.6465 8.6647 1.2439 13.5864 10.2546 1.4277 6.2794 1.3782 1.3345 4.2961 2.9111 1.5941 4.2437 1.2530 1.5585 1.0579 1.1486 6.4085 5.9178 1.8439 3.0227 7.5142 2.5174 5.9001 2.5368 1.5194 1.0833 1.2525 5.4509 3.1572 6.2811 6.1150 1.0290 1.1051 1.0858 1.0895 1.1056 1.0942 1.0952 1.0996
irintensity: 0.0101 0.0488 1.8568 0.3716 3.7599 2.4621 1.8934 0.1858 2.4750 0.7172 0.6459 0.0550 1.9721 2.9177 2.0276 1.0575 0.0877 0.1657 0.0114 1.6965 9.1887 7.1827 17.9564 6.1752 60.9025 49.7154 1.3595 52.5618 63.6537 140.0858 120.4414 4.8243 1.6041 33.5113 0.0021 10.3257 20.4368 4.1851 2.7529 0.0151 0.4932 57.5824 4.8725 10.8664 0.1360 0.0627 4.4103 0.1749 62.4581 60.2972 18.4323 91.8171 383.3509 66.6843 92.1831 126.7580 78.7213 134.4442 27.5545 143.6458 813.0703 20.3514 0.4210 28.0481 33.6440 19.5101 0.2445 13.9452 20.2192 18.3490 6.2427 21.9142
temp: 298.150 k
press: 1.00000 atm
elementType: 17 17 17 8 7 7 7 6 6 6 6 6 6 6 6 6 6 6 1 1 1 1 1 1 1 1
symmnumber: 1
zpe: 452120.7 jmol-1
zpe.correction: 0.172204 hartree
zpe.thermalcorrener: 0.189009 hartree
zpe.thermalcorrenthalpy: 0.189954 hartree
zpe.thermalcorrgfe: 0.124517 hartree
zpe.sumelectzpe: -2042.319092 hartree
zpe.sumelectthermal: -2042.302286 hartree
zpe.sumelectthermalent: -2042.301342 hartree
zpe.sumelectthermalfe: -2042.366778 hartree
dipole: -1.3789 1.5886 -0.0699
dipole: 2.1047
quadrupole: -109.1639 -115.8333 -125.9856
quadrupole: 13.9589 -0.2543 0.1627
quadrupole: 7.8303 1.1610 -8.9913 13.9589 -0.2543 0.1627
hfenergy: -2042.4912954 hartree
pointgroup: C01 [X(C11H8Cl3N3O1)]
dipole: -0.4354283 -0.6991603 0.0853119 debye
dipolederiv: -0.1950145 0.0590208 0.1076602 -0.0012081 -0.4321534 -0.3140379 0.0987401 -0.2554227 -0.4572171 -0.7075183 0.1529455 -0.0706732 0.1323746 -0.1522767 0.0178436 -0.0567275 0.0218587 -0.1387666 -0.2053295 -0.0209627 -0.0710278 -0.0828658 -0.2868773 0.2443997 -0.0368896 0.2052564 -0.6811521 -0.8534296 0.5493251 -0.0190134 0.93397 -1.4019305 0.0431617 -0.0419463 0.0493925 -0.3141288 -1.7230724 -0.2244695 0.072016 -0.4388896 -0.5844761 0.0417672 0.0539823 0.0377681 -0.1079334 -1.4018304 0.602893 -0.003367 0.6439445 -0.8694667 0.0271849 -0.0073041 0.0265703 -0.2011686 -0.6511575 -0.2420621 0.0247393 0.3010487 -1.2604194 0.0708732 0.0017189 0.0653237 -0.1512865 -0.9044303 0.1415681 0.0153885 0.1352514 -0.0577231 -0.0021591 0.0111579 -0.0041915 -0.0350681 2.2836943 -0.2228514 -0.0489107 -0.2401133 0.7618156 -0.0385333 -0.0293824 -0.031718 0.1139318 0.1515829 0.085027 -0.0109185 -0.2747104 0.0056441 0.0009183 0.011776 -0.0068553 -0.098933 0.187203 -0.1549695 0.0010503 0.2164322 -0.0205025 -0.0102742 -0.020264 -0.0009177 -0.1052413 1.0900936 0.2183133 -0.059784 0.1033274 0.8800088 -0.0765388 -0.0939324 -0.1139487 -0.0326664 1.1776791 -0.5056575 0.0061723 -1.0239013 1.9744967 -0.0811605 0.040241 -0.0817517 0.2886227 -0.275186 -0.1337085 0.0109668 -0.2272495 0.1270619 -0.0090888 0.0149239 -0.0123679 -0.1524362 -0.1307381 0.2156561 -0.0116633 0.3208699 -0.0239395 -0.0152709 -0.0177286 -0.0120927 -0.1543487 1.1766305 -0.2234496 0.0437378 -0.1899582 0.7836946 0.0747813 0.056107 0.0861763 1.3004753 0.1315022 -0.0172931 -0.0048664 -0.0292865 0.055664 -0.0094431 -0.0042836 -0.0095417 -0.1286822 0.6965944 -0.4207186 0.0133215 -0.225349 0.436822 -0.0052191 -0.0003113 0.0013229 0.2515655 0.1143381 -0.0790342 0.0039624 -0.0781604 0.0451321 0.0068861 0.0049703 0.0063415 0.1413459 0.1497636 0.0507213 -0.0030357 0.0345247 0.0082176 0.0068941 -0.0015894 0.0066402 0.1512868 0.0403695 0.0579583 -0.0005105 0.0950539 -0.0872779 0.0108344 -0.0025063 0.0117381 0.1560996 -0.027613 -0.0870382 0.0092731 -0.118324 -0.0250356 0.0128971 0.0109199 0.0119443 0.1570976 -0.1297624 0.0386199 0.0047354 0.0392492 0.0895615 0.0027038 0.0044444 0.0027115 0.1555628 0.0702917 0.0079549 0.0013062 0.0822194 -0.1343731 0.0149439 -0.0033284 0.0163648 0.1274973 -0.0348626 0.0719611 -0.0419716 -0.0606348 0.0753324 -0.0931381 -0.0554564 -0.0682664 -0.0294068 -0.0297983 0.0802505 0.0314122 -0.0476149 0.0930003 0.0787746 0.0626688 0.0476652 -0.0550496 unknown
polarizability: 266.3161713|-21.3741339|188.1208422|-3.2026829|-4.7091389|97.866849 unknown
InChI: InChI=1S/C11H8Cl3N3O/c1-18-10-16-8(7-5-3-2-4-6-7)15-9(17-10)11(12,13)14/h2-6H,1H3
charge 0 multiplicity 1
26 atoms
Cl 2.132746 2.968637 1.058413
Cl 4.323931 1.218667 -0.036475
Cl 2.316845 2.450883 -1.926172
O  1.648319 -3.045384 0.099977
N  0.278288 0.791749 -0.092056
N  -0.13675 -1.591743 0.061927
N  2.141273 -0.746969 -0.051273
C  -2.027488 -0.035375 0.015066
C  -0.574518 -0.293409 -0.005648
C  -2.514366 1.29917 -0.046109
C  -2.943044 -1.120134 0.095999
C  1.597986 0.496563 -0.107888
C  1.211891 -1.754169 0.034326
C  -3.902127 1.542452 -0.027061
C  -4.329167 -0.869649 0.114391
C  2.55172 1.694667 -0.23125
C  -4.812176 0.460533 0.052897
C  3.117571 -3.269103 0.073713
H  -1.792628 2.118927 -0.107565
H  -2.546516 -2.138708 0.142826
H  -4.276301 2.570655 -0.074337
H  -5.033799 -1.705821 0.176283
H  -5.891014 0.652334 0.067307
H  3.218491 -4.360831 0.141125
H  3.59654 -2.765811 0.929103
H  3.546895 -2.881529 -0.86432
