program: Gaussian 09
title: 000035565
version: EM64L-G09RevD.01
frameworkgroup: C1[X(C9H15N3S3)]
method: RPBEPBE
basis: SDD
operation: Freq
keyword: #p
keyword: freq=noraman
keyword: PBEPBE/SDD
title: #p freq=noraman PBEPBE/SDD
converged: YES YES NO NO
title: Mulliken charges:
elementType: S S S N N N C C C C C C C C C H H H H H H H H H H H H H H H
charge: 0.281239 0.282897 0.271151 0.068869 0.063281 0.061653 -0.577904 -0.575584 -0.573137 -0.357370 -0.340082 -0.324817 -0.663767 -0.662727 -0.662649 0.279213 0.279521 0.270752 0.271005 0.271961 0.272106 0.230302 0.230223 0.226615 0.232182 0.232030 0.224416 0.231581 0.231553 0.225488
chargesum: 0.00000
title: Mulliken charges with hydrogens summed into heavy atoms:
elementType: S S S N N N C C C C C C C C C
charge: 0.281239 0.282897 0.271151 0.068869 0.063281 0.061653 -0.019169 -0.033828 -0.029070 -0.357370 -0.340082 -0.324817 0.023373 0.025901 0.025973
polarizability: 2.77307843e+02 4.13889050e-01 2.05965852e+02 -6.10460615e-02 8.70199591e-02 9.10949110e+01
1716.lowfreq: -5.4323 -1.4887 -0.0019 -0.0017 0.0004 1.4633 27.5662 31.2004 46.3345
frequency: 27.3488 31.1141 46.2227 62.9604 66.9782 67.8717 76.8171 78.5305 133.5289 135.3158 160.3360 165.1639 201.9160 228.3734 231.3178 235.5624 237.0233 252.3063 293.3298 321.9309 423.1781 427.8480 468.9416 495.1918 610.2589 613.8797 620.4022 624.0549 633.9317 776.6173 777.2770 781.6693 786.2832 792.5944 793.7056 890.5015 994.0494 994.8450 996.0609 1041.8603 1043.8030 1044.8259 1066.6470 1067.8028 1068.2071 1179.7564 1191.4518 1197.9351 1230.8614 1234.7768 1235.1752 1240.8557 1272.0915 1280.6037 1285.2617 1392.5751 1398.8128 1399.5983 1401.4120 1417.0681 1444.5488 1447.5420 1452.7058 1471.6004 1472.2522 1472.5894 1482.1177 1482.7201 1482.8750 2988.1367 2988.3220 2988.8700 3044.5574 3045.5919 3050.8215 3082.7602 3083.1116 3083.1183 3085.6646 3085.7110 3086.3004 3125.4010 3125.6208 3131.1240
redmass: 3.0597 3.6087 2.6706 2.3725 2.1335 3.5758 2.1849 3.8444 4.2660 13.4418 11.0226 9.5378 6.0386 5.0668 1.1350 1.1285 1.1161 3.8008 3.8294 4.6717 10.4410 11.4785 12.2897 11.2152 12.2005 12.0380 4.7441 4.6659 4.9339 1.1420 1.1176 1.2527 5.0564 12.8076 13.6083 13.9527 1.7970 1.7952 1.8047 1.2125 1.2127 1.2203 2.2721 2.2511 2.2690 11.9563 9.2281 9.0894 1.2325 1.2251 1.2296 4.8248 1.3310 1.3087 1.4904 9.1011 1.2224 1.2172 1.2116 9.3824 1.0859 1.0941 1.0937 1.0392 1.0388 1.0386 1.0482 1.0482 1.0481 1.0356 1.0357 1.0358 1.0590 1.0591 1.0598 1.0977 1.0974 1.0971 1.1014 1.1012 1.1014 1.1080 1.1079 1.1082
irintensity: 0.0029 2.2517 0.0195 0.1995 2.7130 0.1893 0.8530 1.6400 1.2458 0.0076 0.0017 0.0001 1.0794 1.5255 0.0381 0.0350 0.0505 0.4082 0.5015 8.3723 6.8422 1.1041 1.3681 1.1726 0.0029 0.0044 4.2820 0.6443 4.4313 15.4001 0.5093 15.7081 0.3884 95.3723 160.7462 0.1009 4.7622 46.8772 18.8346 0.0082 0.2430 0.3323 10.4102 3.3058 3.6174 85.6233 326.7511 208.0011 0.0595 0.1119 1.0430 2.8137 7.6520 39.9587 0.8907 761.8809 68.8328 7.0703 48.8412 1001.1423 8.9236 1.3132 0.0686 15.7260 4.1475 26.9657 7.1022 6.0499 8.3346 50.2305 27.5891 29.4641 11.9059 1.9784 4.1902 16.6320 22.3356 29.7831 8.1209 18.9908 11.2250 23.4324 27.8932 20.4578
temp: 298.150 k
press: 1.00000 atm
elementType: 16 16 16 7 7 7 6 6 6 6 6 6 6 6 6 1 1 1 1 1 1 1 1 1 1 1 1 1 1 1
symmnumber: 1
zpe: 606809.8 jmol-1
zpe.correction: 0.231122 hartree
zpe.thermalcorrener: 0.249880 hartree
zpe.thermalcorrenthalpy: 0.250824 hartree
zpe.thermalcorrgfe: 0.181006 hartree
zpe.sumelectzpe: -1709.227199 hartree
zpe.sumelectthermal: -1709.208442 hartree
zpe.sumelectthermalent: -1709.207497 hartree
zpe.sumelectthermalfe: -1709.277315 hartree
dipole: 2.5937 2.8798 0.0084
dipole: 3.8756
quadrupole: -86.2366 -118.1408 -113.3244
quadrupole: -1.1252 -0.0235 -0.0259
quadrupole: 19.6640 -12.2402 -7.4238 -1.1252 -0.0235 -0.0259
hfenergy: -1709.4583211 hartree
pointgroup: C01 [X(C9H15N3S3)]
dipole: -1.0510244 1.1046652 0.0065573 debye
polarizability: 277.2109159|1.5106434|205.9861747|-3.5170283|-1.1125862|91.1715154 unknown
InChI: InChI=1S/C9H15N3S3/c1-4-13-7-10-8(14-5-2)12-9(11-7)15-6-3/h4-6H2,1-3H3
charge 0 multiplicity 1
30 atoms
S  3.332325 -1.255028 -0.191058
S  -1.84116 -2.629506 -0.080371
S  -0.398016 2.675479 -0.158876
N  0.685921 -1.727961 -0.136097
N  1.323708 0.615864 -0.171974
N  -1.025798 -0.001974 -0.121483
C  4.228657 0.424483 -0.229237
C  -3.458598 -1.628442 -0.061714
C  -2.299201 2.636491 -0.120736
C  1.610969 -0.720846 -0.163654
C  -0.610785 -1.308923 -0.116415
C  -0.010022 0.91077 -0.149916
C  5.740757 0.16584 -0.250799
C  -4.635083 -2.613409 -0.043956
C  -2.8121 4.082671 -0.122344
H  3.876979 0.95976 -1.124376
H  3.906612 0.984833 0.661619
H  -3.434518 -0.984464 0.831066
H  -3.457565 -0.988988 -0.958016
H  -2.631599 2.069676 -1.004152
H  -2.595928 2.084298 0.78438
H  6.074298 -0.383984 0.647146
H  6.044237 -0.410132 -1.142975
H  6.276222 1.132646 -0.273884
H  -4.636515 -3.262373 -0.937559
H  -4.613117 -3.258589 0.852148
H  -5.586488 -2.050546 -0.032541
H  -2.457018 4.641865 0.761335
H  -2.49245 4.627377 -1.02832
H  -3.917326 4.081213 -0.10044
