program: Gaussian 09
title: 000035525
version: EM64L-G09RevD.01
frameworkgroup: C1[X(C9H14N2O)]
method: RPBEPBE
basis: SDD
operation: Freq
keyword: #p
keyword: freq=noraman
keyword: PBEPBE/SDD
title: #p freq=noraman PBEPBE/SDD
converged: YES YES NO NO
title: Mulliken charges:
elementType: O N N C C C C C C C C C H H H H H H H H H H H H H H
charge: -0.271440 -0.199475 -0.199475 -0.411559 -0.411560 0.285508 -0.097652 -0.097649 -0.198536 -0.198536 -0.737893 -0.737893 0.244147 0.244026 0.244154 0.244019 0.265954 0.265953 0.216616 0.216616 0.220893 0.220927 0.225518 0.220891 0.220928 0.225518
chargesum: 0.00000
title: Mulliken charges with hydrogens summed into heavy atoms:
elementType: O N N C C C C C C C C C
charge: -0.271440 -0.199475 -0.199475 0.076614 0.076614 0.285508 0.168302 0.168304 0.018081 0.018080 -0.070556 -0.070556
polarizability: 2.20512329e+02 -5.98798551e-07 1.06755814e+02 6.74775758e-03 -3.83075139e-03 6.56837166e+01
1716.lowfreq: -1.6481 -0.0008 0.0005 0.0006 7.1583 20.8373 44.3697 77.1106 88.1796
frequency: 44.3423 77.1099 88.1796 119.8744 143.9169 150.1334 157.7248 193.5356 205.5689 212.0592 308.5572 336.5852 338.0528 343.1619 346.3212 372.3359 653.2600 657.0745 675.2663 684.5745 788.8497 789.6076 794.1571 871.6780 909.1553 944.9074 959.9067 961.6212 1002.9840 1011.5453 1040.4208 1040.8298 1092.2970 1106.8321 1114.5341 1158.9636 1200.3796 1221.0439 1234.5893 1278.2240 1284.4284 1307.9672 1308.6229 1334.2408 1363.3114 1380.3859 1391.7102 1400.8414 1410.2657 1461.9170 1461.9611 1477.4747 1478.1130 1496.6859 1507.6560 1663.5446 1686.8200 1690.2116 2960.3837 2960.7399 2977.6208 2988.2342 3018.1330 3030.7206 3030.7250 3042.7307 3072.6291 3072.6533 3103.8088 3104.0242 3147.0322 3147.5253
redmass: 4.1461 1.7490 3.5335 4.0904 1.2356 1.1477 3.7785 3.4197 1.9117 1.8334 3.9233 2.8229 5.5486 3.0881 3.6620 3.3542 5.3524 6.6247 4.4984 10.5818 1.5964 1.5604 4.4513 1.1788 1.9052 1.6524 1.1175 1.1150 2.6808 2.4126 1.4301 1.4278 3.0360 1.5996 2.9697 3.0686 1.1266 1.0791 3.0671 1.8152 1.4138 1.4590 1.2768 1.5971 1.9714 2.5116 1.4571 1.3828 2.0210 1.0472 1.0472 1.0610 1.0658 1.1044 1.0855 11.6756 5.7735 5.9270 1.0367 1.0367 1.0569 1.0592 1.1075 1.0976 1.0976 1.1067 1.0966 1.0966 1.0923 1.0923 1.0907 1.0909
irintensity: 0.8641 0.0001 0.0181 0.0000 1.0923 0.0001 9.9703 4.6547 4.1745 0.0000 0.0021 0.0420 1.7039 0.0018 0.9235 1.4094 0.1047 6.0420 36.0665 10.4568 0.0001 42.1153 3.0748 0.7519 52.5652 6.3878 0.0005 115.7399 0.3492 5.6442 0.0000 5.3577 22.1108 0.0000 21.5122 11.8486 1.7268 0.0016 123.2350 246.0279 4.4858 268.9900 0.0161 17.2244 9.7598 4.1368 203.1928 6.9386 458.8873 0.0003 28.6115 2.8770 24.3759 60.6289 2.7878 369.0319 211.8865 2.9283 140.6242 1.9162 14.8387 62.0140 0.0184 62.8865 0.9840 55.8407 11.3585 21.3205 10.3517 70.8725 25.6028 1.2469
temp: 298.150 k
press: 1.00000 atm
elementType: 8 7 7 6 6 6 6 6 6 6 6 6 1 1 1 1 1 1 1 1 1 1 1 1 1 1
symmnumber: 1
zpe: 570578.5 jmol-1
zpe.correction: 0.217322 hartree
zpe.thermalcorrener: 0.230461 hartree
zpe.thermalcorrenthalpy: 0.231405 hartree
zpe.thermalcorrgfe: 0.177534 hartree
zpe.sumelectzpe: -535.151748 hartree
zpe.sumelectthermal: -535.138610 hartree
zpe.sumelectthermalent: -535.137666 hartree
zpe.sumelectthermalfe: -535.191536 hartree
dipole: 0.0000 -4.6240 -0.0003
dipole: 4.6240
quadrupole: -64.5872 -73.2300 -75.3926
quadrupole: 0.0000 0.0164 -0.0007
quadrupole: 6.4827 -2.1601 -4.3227 0.0000 0.0164 -0.0007
hfenergy: -535.3690703 hartree
pointgroup: C01 [X(C9H14N2O1)]
dipole: -0.0000054 1.8192071 0.0000937 debye
dipolederiv: -0.6561825 0.0000031 -0.0001403 0.0000003 -1.251092 0.0004631 -0.0008873 -0.0005538 -0.3598405 -2.2114107 -0.2616182 0.0006489 -0.3035424 -0.6401397 -0.0004708 -0.0008119 -0.0010347 -0.1847326 -2.2114033 0.2616106 0.0003237 0.3035356 -0.6401347 0.0002866 -0.001882 0.0012316 -0.1847301 0.0432244 -0.0167958 -0.0001807 0.059652 0.445131 -0.00052 -0.0006257 -0.0002997 0.3362409 0.0432252 0.0167944 -0.0002782 -0.0596548 0.4451277 0.0007467 -0.0009889 0.0003842 0.3362408 2.6964795 0.0000023 0.0023105 0.0000061 1.7044317 -0.0005049 0.006425 0.0003523 0.235061 1.3865984 0.0073132 -0.0020397 -0.3594421 0.033967 0.0005505 -0.0019668 0.0001729 -0.0749222 1.3865992 -0.007309 -0.0014259 0.3594462 0.0339695 -0.0005566 -0.0012619 -0.000224 -0.0749242 -0.202539 -0.0145588 -0.000697 -0.3268744 0.0899611 0.0008872 0.0005489 0.0007505 -0.3629993 -0.2025429 0.0145581 -0.0005472 0.3268738 0.0899622 -0.0008962 0.0003547 -0.0009007 -0.362999 -0.0498762 0.0392261 0.0002804 -0.0741191 0.0278637 -0.0000958 -0.0008009 -0.0002216 0.1172214 -0.0498748 -0.0392265 0.0002256 0.0741187 0.0278641 0.0001336 -0.0008011 0.0002243 0.1172213 0.0182536 -0.0659094 0.0691255 -0.0234237 -0.0278721 0.0524988 0.0661962 0.1030454 -0.0621348 0.0184942 -0.0662561 -0.0686909 -0.0239912 -0.0284586 -0.0530498 -0.0660318 -0.102914 -0.0609132 0.0182008 0.0659399 0.0691474 0.0233383 -0.0279461 -0.0525659 0.0662228 -0.1030902 -0.0621177 0.0185472 0.0662257 -0.0686692 0.0240765 -0.0283823 0.0529816 -0.0660059 0.1028684 -0.0609301 0.0952617 0.0016359 0.0001916 0.082505 -0.0016749 -0.0000904 0.0002118 -0.0001962 0.1777524 0.0952621 -0.0016355 0.0001148 -0.0825049 -0.0016759 0.0001483 0.0001803 0.0002634 0.1777521 0.0339574 0.0699791 0.0003623 0.0848658 -0.1403159 -0.0004927 0.0005598 -0.000544 0.1934818 0.0339565 -0.0699787 0.0002906 -0.084865 -0.1403166 0.0005835 0.0004836 0.0006504 0.1934812 -0.1083168 -0.0225081 0.1025836 0.016467 0.0829551 0.0781013 0.1776305 0.0603039 -0.0635219 -0.1096927 -0.0223762 -0.1027342 0.0169694 0.0834246 -0.0775602 -0.1774081 -0.0597402 -0.063175 0.0658948 -0.0498115 0.0000108 0.0732147 -0.151514 -0.0005364 0.000247 -0.000304 0.1100926 -0.1084828 0.0225872 0.1025723 -0.0163665 0.082897 -0.0781626 0.1775976 -0.0603561 -0.0633156 -0.1095279 0.022296 -0.1027468 -0.017071 0.0834824 0.0774974 -0.1774422 0.0596864 -0.0633812 0.0658944 0.0498121 -0.0000377 -0.0732142 -0.1515141 0.0006234 0.0002562 0.0004454 0.1100921 unknown
polarizability: 220.512298|0.0001995|106.7558135|-0.0695487|-0.0047822|65.6837477 unknown
InChI: InChI=1S/C9H14N2O/c1-3-5-10-7-8-11(6-4-2)9(10)12/h3-6H,7-8H2,1-2H3
charge 0 multiplicity 1
26 atoms
O  -0.000006 -1.97537 0.000417
N  1.130255 0.127343 0.003581
N  -1.130276 0.127338 -0.002473
C  0.780424 1.556524 0.000118
C  -0.780452 1.556522 0.000783
C  -0.00001 -0.71564 0.001063
C  2.444095 -0.364366 0.000587
C  -2.444115 -0.364375 -0.000141
C  3.571552 0.401878 -0.000863
C  -3.571575 0.401864 0.000334
C  4.9673 -0.178574 -0.003922
C  -4.967323 -0.178591 0.002893
H  1.195079 2.055324 -0.896201
H  1.195505 2.060254 0.893376
H  -1.195224 2.055481 0.896958
H  -1.195419 2.060088 -0.892621
H  2.484641 -1.459349 -0.000208
H  -2.484657 -1.459359 0.001094
H  3.492413 1.498488 0.000406
H  -3.49244 1.498474 -0.001368
H  5.541236 0.148304 -0.893511
H  5.543923 0.14529 0.88505
H  4.942922 -1.282844 -0.005734
H  -5.541755 0.148674 0.892021
H  -5.543453 0.144881 -0.88654
H  -4.942942 -1.28286 0.005203
