program: Gaussian 09
title: 000035526
version: EM64L-G09RevD.01
frameworkgroup: C1[X(C7H14N2S)]
method: RPBEPBE
basis: SDD
operation: Freq
keyword: #p
keyword: freq=noraman
keyword: PBEPBE/SDD
title: #p freq=noraman PBEPBE/SDD
converged: YES YES NO NO
title: Mulliken charges:
elementType: S N N C C C C C C C H H H H H H H H H H H H H H
charge: -0.054402 -0.106762 -0.106808 -0.380173 -0.380096 -0.147635 -0.335238 -0.335274 -0.664325 -0.664297 0.229178 0.229464 0.229178 0.229441 0.252185 0.202911 0.252186 0.202891 0.204484 0.248832 0.220473 0.204469 0.248845 0.220470
chargesum: 0.00000
title: Mulliken charges with hydrogens summed into heavy atoms:
elementType: S N N C C C C C C C
charge: -0.054402 -0.106762 -0.106808 0.078470 0.078523 -0.147635 0.119857 0.119803 0.009465 0.009488
polarizability: 1.22464543e+02 -5.41550030e-03 1.19384229e+02 4.73131504e+00 7.32690127e-03 7.31134488e+01
1716.lowfreq: -15.5194 -14.8494 -0.0021 0.0012 0.0013 8.2859 48.0800 49.7986 71.6684
frequency: 48.0365 49.7980 71.6521 113.0318 139.6748 163.1082 201.5737 212.3632 268.5908 304.8834 374.0225 383.0478 463.6082 502.2490 598.4773 600.6650 623.5415 775.9690 777.8603 819.1648 906.7920 947.6314 965.3929 990.1733 1014.9516 1069.7088 1074.2860 1092.9863 1112.1826 1128.0979 1173.7744 1204.8767 1207.1764 1267.6495 1268.0323 1288.9102 1311.3474 1321.4109 1355.9750 1356.0135 1382.1360 1382.5201 1418.2024 1429.0720 1457.4402 1459.8105 1471.6778 1472.1827 1480.2861 1480.7761 1495.0928 1499.9411 2956.2336 2957.8553 2984.1891 2984.2644 2986.9744 2987.5927 3035.6000 3048.6660 3051.7467 3052.0145 3080.1552 3080.2261 3096.5003 3096.5650
redmass: 2.9034 2.5381 3.3243 2.5415 2.3427 3.1846 1.1502 1.2938 2.6709 1.8808 2.9151 3.9993 2.7458 5.7394 3.4939 6.1123 3.9571 1.2366 1.1758 1.5108 1.9636 2.4476 2.4355 2.4302 3.8450 2.3221 1.8750 1.6614 1.9320 1.8055 1.2693 1.3345 2.3298 1.7670 1.7254 2.0216 1.3123 2.1688 1.2652 1.2617 1.2108 1.2143 1.9051 1.8071 1.2543 1.1835 1.0437 1.0448 1.0625 1.0580 1.1994 1.1243 1.0710 1.0619 1.0357 1.0371 1.0621 1.0609 1.0936 1.1014 1.1003 1.1001 1.0993 1.0992 1.1014 1.1014
irintensity: 1.0129 0.0713 4.3590 0.0127 1.2107 4.6628 0.3435 2.1778 4.5754 1.2282 8.6030 3.5312 3.7423 4.3068 2.1778 3.0157 16.4266 3.3726 18.8515 1.3301 21.6818 0.1565 0.7198 6.7420 1.3536 20.5936 0.0061 18.2217 2.7972 15.0364 5.0230 4.9489 17.0024 255.5579 104.8480 14.1166 4.9919 71.4089 12.2451 2.7970 45.3135 1.1338 97.2642 77.1882 93.6802 12.1787 7.9268 11.6622 2.4312 10.3748 71.7583 5.5944 65.8052 53.5621 60.4746 1.9241 112.0686 13.9037 37.3718 43.5569 2.5786 0.0060 40.0861 42.1429 34.6084 21.3839
temp: 298.150 k
press: 1.00000 atm
elementType: 16 7 7 6 6 6 6 6 6 6 1 1 1 1 1 1 1 1 1 1 1 1 1 1
symmnumber: 1
zpe: 540571.0 jmol-1
zpe.correction: 0.205893 hartree
zpe.thermalcorrener: 0.217545 hartree
zpe.thermalcorrenthalpy: 0.218490 hartree
zpe.thermalcorrgfe: 0.167327 hartree
zpe.sumelectzpe: -781.913363 hartree
zpe.sumelectthermal: -781.901710 hartree
zpe.sumelectthermalent: -781.900766 hartree
zpe.sumelectthermalfe: -781.951928 hartree
dipole: 0.0010 -5.4504 0.0017
dipole: 5.4504
quadrupole: -61.0394 -72.0294 -70.0868
quadrupole: 0.0012 2.0557 0.0026
quadrupole: 6.6792 -4.3108 -2.3683 0.0012 2.0557 0.0026
hfenergy: -782.1192556 hartree
pointgroup: C01 [X(C7H14N2S1)]
dipole: 0.0002705 -2.1443605 0.0004435 debye
dipolederiv: -0.4669539 0.0002092 -0.0139861 0.0000965 -0.8961556 -0.0000504 -0.0272446 -0.0005251 -0.2874437 -1.1247918 0.2104517 -0.0705402 0.4273464 -0.8154704 0.0728258 -0.3472395 0.1730713 -0.3726618 -1.1251605 -0.2108479 -0.0707615 -0.4273641 -0.815701 -0.0730696 -0.3464418 -0.1726554 -0.3727123 -0.0119938 0.0574046 -0.0760932 -0.1117465 0.5201351 0.0143054 -0.0772884 0.0364648 0.349017 -0.0121716 -0.0574742 -0.0759381 0.1116246 0.5202574 -0.0141427 -0.0770125 -0.0364519 0.349044 1.3871977 0.0001064 0.2934881 -0.0000791 1.5657164 0.000141 0.4862728 0.0000029 0.0262298 0.7247884 0.0111723 0.000666 0.2049117 0.0523645 -0.0283206 0.1110242 -0.1072558 0.3190745 0.7250469 -0.0109947 0.0006108 -0.204642 0.052481 0.0284213 0.1109104 0.1074341 0.319107 -0.1301727 -0.0031133 0.0476627 -0.0255783 0.0898675 0.0187163 0.0708473 0.0539533 -0.092385 -0.1302214 0.003043 0.0476103 0.0255308 0.0897762 -0.0187746 0.0707534 -0.0540639 -0.0925005 0.0465132 0.0641651 -0.0472025 0.0629462 -0.0736349 0.0687545 -0.0648423 0.1297939 -0.0406206 -0.0031319 0.0478163 0.0921313 0.0651802 -0.0592616 -0.0276337 0.1291591 -0.1431959 -0.0958234 0.0464858 -0.0641836 -0.0472392 -0.062912 -0.0737896 -0.0688047 -0.0648443 -0.1298353 -0.040584 -0.0030486 -0.0477323 0.0920817 -0.06519 -0.0592235 0.0275872 0.1290881 0.1431638 -0.0958539 0.0914677 0.0106465 0.0567374 -0.0941882 -0.0120322 -0.1013696 0.0479969 -0.0341571 0.0576455 -0.0605439 0.0245073 -0.0447932 0.0865699 0.0025941 0.1604652 -0.060685 0.1050391 -0.0742656 0.0914489 -0.0105984 0.056758 0.0942163 -0.012013 0.1013864 0.0479972 0.0341676 0.0575355 -0.06063 -0.0245853 -0.044857 -0.0867859 0.002474 -0.1604706 -0.0606703 -0.105046 -0.0741451 0.0987278 -0.006242 0.0163314 0.0542587 -0.1322688 -0.1095739 0.0390497 -0.0716852 0.0260114 0.0918372 0.0643774 -0.0735722 0.0289276 0.0200386 0.0911785 -0.037539 0.0629072 -0.0230292 -0.1826536 -0.0706909 -0.0409454 -0.1010026 0.0729957 -0.0236053 -0.0404219 -0.0354264 0.0776327 0.0987595 0.0063151 0.0162922 -0.0541669 -0.1321958 0.109678 0.0389938 0.0717562 0.0259102 0.091892 -0.0644399 -0.0736128 -0.0289234 0.0200046 -0.0911858 -0.0376429 -0.062836 -0.0228711 -0.1826916 0.0706876 -0.0408286 0.1009701 0.0730411 0.0235419 -0.0402204 0.0353796 0.0776885 unknown
polarizability: 122.6188649|-0.0058756|119.3842275|3.8399894|0.0122093|72.959128 unknown
InChI: InChI=1S/C7H14N2S/c1-3-8-5-6-9(4-2)7(8)10/h3-6H2,1-2H3
charge 0 multiplicity 1
24 atoms
S  -0.000383 2.253814 -0.000079
N  1.062458 -0.285152 0.363434
N  -1.062678 -0.285306 -0.364265
C  0.773043 -1.708907 0.078557
C  -0.772996 -1.709005 -0.079309
C  0.000058 0.534178 -0.001052
C  2.417895 0.205339 0.635699
C  -2.418351 0.205061 -0.635565
C  3.321743 0.252577 -0.617578
C  -3.321237 0.252741 0.6184
H  1.112296 -2.357529 0.905582
H  1.276064 -2.037792 -0.854291
H  -1.112333 -2.357761 -0.906193
H  -1.275798 -2.037868 0.853664
H  2.304386 1.224557 1.047325
H  2.868234 -0.436985 1.417469
H  -2.305167 1.224122 -1.047675
H  -2.869276 -0.437572 -1.416739
H  3.461392 -0.748227 -1.066448
H  2.881015 0.923591 -1.374991
H  4.319603 0.644074 -0.348143
H  -3.460488 -0.747897 1.067762
H  -2.879948 0.924055 1.375219
H  -4.319332 0.644091 0.349617
