program: Gaussian 09
title: 000035590
version: EM64L-G09RevD.01
frameworkgroup: C1[X(C6H3Br6N3O)]
method: RPBEPBE
basis: SDD
operation: Freq
keyword: #p
keyword: freq=noraman
keyword: PBEPBE/SDD
title: #p freq=noraman PBEPBE/SDD
converged: YES YES NO NO
title: Mulliken charges:
elementType: Br Br Br Br Br Br O N N N C C C C C C H H H
charge: 0.173187 0.166001 0.197688 0.209542 0.151015 0.155015 -0.187094 0.062427 0.004059 0.048092 0.248100 0.306088 -0.927147 -0.918978 0.057246 -0.502633 0.255487 0.255382 0.246523
chargesum: 0.00000
title: Mulliken charges with hydrogens summed into heavy atoms:
elementType: Br Br Br Br Br Br O N N N C C C C C C
charge: 0.173187 0.166001 0.197688 0.209542 0.151015 0.155015 -0.187094 0.062427 0.004059 0.048092 0.248100 0.306088 -0.927147 -0.918978 0.057246 0.254760
polarizability: 2.11915249e+02 -8.69785080e+00 2.13464296e+02 2.35042408e-01 -1.11877992e-02 1.67683957e+02
1716.lowfreq: -5.6339 -1.8922 0.0002 0.0003 0.0004 0.6551 3.6940 6.4329 49.0001
frequency: -0.3345 5.7847 48.9987 54.0240 66.1107 91.2300 102.9860 104.6443 123.1772 129.9920 145.8288 146.6980 151.8688 162.6113 199.4278 203.7082 215.9383 225.0153 239.5080 249.5534 270.7625 360.3398 497.6424 537.8093 574.7748 582.3565 624.5780 677.5483 722.9349 723.4433 732.6214 743.8510 831.9964 890.8522 900.2394 982.9291 1033.5034 1113.9289 1149.3840 1195.7159 1276.5230 1285.4026 1372.3761 1426.4682 1449.8694 1452.8933 1460.3696 1480.8232 3014.8133 3122.9569 3163.7622
redmass: 34.0485 18.9152 11.8950 46.0334 21.3129 22.8092 5.4427 16.7880 5.5768 1.1983 28.9064 28.4752 20.3930 37.9331 10.1456 7.6510 32.8748 14.2898 21.2813 10.9089 10.9969 7.8103 9.0541 12.8060 12.5482 7.8524 12.6751 11.7944 10.9613 12.0840 11.1420 12.1127 12.6371 11.1980 12.4990 10.6398 8.3811 1.2538 1.6070 7.1813 10.6385 10.7938 2.6982 6.8240 1.8650 1.0495 1.3615 3.5849 1.0291 1.1053 1.1057
irintensity: 0.1328 0.0618 0.2756 0.0558 0.4083 0.6551 3.8385 1.1134 1.9719 0.0617 0.2622 0.3284 0.0198 0.0813 3.2143 0.9054 1.2986 0.5771 3.7257 7.1158 0.4519 9.0612 11.8700 0.9416 220.3445 12.4211 72.0954 222.9728 7.8689 86.6140 47.4922 0.7798 0.3656 41.5408 16.9535 6.3076 19.9860 0.0529 5.4845 56.2035 145.0958 90.0927 189.9171 280.2837 88.5339 18.2806 90.3159 485.7865 23.8171 15.5712 15.8557
temp: 298.150 k
press: 1.00000 atm
elementType: 35 35 35 35 35 35 8 7 7 7 6 6 6 6 6 6 1 1 1
symmnumber: 1
zpe: 229207.9 jmol-1
zpe.correction: 0.087301 hartree
zpe.thermalcorrener: 0.105454 hartree
zpe.thermalcorrenthalpy: 0.106398 hartree
zpe.thermalcorrgfe: 0.034649 hartree
zpe.sumelectzpe: -549.422694 hartree
zpe.sumelectthermal: -549.404540 hartree
zpe.sumelectthermalent: -549.403596 hartree
zpe.sumelectthermalfe: -549.475346 hartree
dipole: -1.9487 2.7702 -0.0106
dipole: 3.3869
quadrupole: -151.8204 -133.6340 -143.5834
quadrupole: -10.0691 0.2825 -0.0177
quadrupole: -8.8078 9.3786 -0.5708 -10.0691 0.2825 -0.0177
hfenergy: -549.5099945 hartree
pointgroup: C01[X(C6H3Br6N3O1)]
dipole: -0.9122194 0.9688508 0.0692649 debye
dipolederiv: -0.1445636 0.043518 -0.0368394 0.069487 -0.3606373 0.3898621 -0.0138508 0.3359342 -0.4822198 -0.173862 0.047139 0.0679892 0.0785472 -0.1812179 -0.2980391 0.0545725 -0.2490875 -0.6802804 -0.3260787 -0.3675725 -0.0596226 -0.3762014 -0.4067886 -0.0656691 -0.0570616 -0.0635515 -0.0483683 -0.070071 0.2287336 0.0398121 0.2261452 -0.5937913 -0.0998774 0.0421528 -0.0909044 -0.0499565 -0.3081307 -0.0296813 0.3197284 -0.0086911 -0.0951094 -0.0717432 0.3005725 -0.056587 -0.6614291 -0.3555239 0.09117 -0.3416113 0.1126629 -0.1514379 0.1992237 -0.310143 0.1816629 -0.5067618 -0.5443535 0.4173738 0.0327418 0.571187 -1.6031223 -0.1042073 0.0458223 -0.1094297 -0.2927633 -1.565755 -0.1743441 -0.0171354 -0.2303864 -0.4652274 -0.0320686 -0.0590242 -0.0372486 -0.0974175 -0.5450012 -0.4401116 -0.0400538 0.0509475 -1.3557475 -0.0944179 0.0044504 -0.119466 -0.1424563 -0.8430005 0.5556782 0.0440781 0.3307679 -0.9286966 -0.0644928 0.0189593 -0.0464533 -0.197985 1.322495 -0.2243736 -0.0235485 -0.2549161 0.5837167 0.0517755 -0.0368813 0.0634731 -0.0217036 1.118206 0.4163877 0.0306345 0.1724704 0.7899078 0.0633109 -0.011897 0.0446566 -0.052462 0.5697512 0.3897375 0.0476594 0.4781602 1.0400978 -0.0275306 0.0768592 -0.0375197 1.3032329 0.6437719 -0.4765013 -0.0223351 -0.367118 0.9647128 -0.0153279 0.0098034 0.0032668 1.3116939 0.6369415 -0.1840827 -0.0195291 -0.6117846 2.1896768 0.1495988 -0.0461582 0.1592034 0.3220778 0.5146702 -0.4467473 -0.0335062 -0.2074527 0.5476628 0.0245579 -0.0145745 0.0241219 0.2348837 -0.0061489 0.0854389 0.0505102 -0.040153 0.060307 0.08936 0.0629085 0.060482 -0.0191271 -0.0039836 0.0965733 -0.0352292 -0.0254386 0.0847595 -0.0720804 -0.0683228 -0.0386686 -0.0467624 0.0806369 -0.0283354 -0.003743 0.0317668 -0.1190649 -0.0222346 0.0018125 -0.0238844 0.127805 unknown
polarizability: 214.3595384|-8.5945096|210.7146751|-0.0635638|3.5761386|167.9892886 unknown
InChI: InChI=1S/C6H3Br6N3O/c1-16-4-14-2(5(7,8)9)13-3(15-4)6(10,11)12/h1H3
charge 0 multiplicity 1
19 atoms
Br 2.915372 -1.841268 1.41305
Br 2.978453 -1.365296 -1.852164
Br 4.067878 0.961072 0.181151
Br -1.569348 -3.279522 -0.492462
Br -3.174833 -1.294431 1.560989
Br -3.364981 -0.830327 -1.702866
O  -0.470656 3.091641 0.213221
N  0.278827 -0.899057 -0.119892
N  -1.316511 0.903736 0.017317
N  1.064915 1.381791 0.087431
C  1.266368 0.054496 -0.022102
C  -0.98281 -0.415807 -0.095637
C  2.707737 -0.47486 -0.055936
C  -2.156692 -1.403035 -0.187557
C  -0.259404 1.755758 0.10275
C  -1.883387 3.560613 0.233149
H  -2.419034 3.113208 1.085816
H  -2.386887 3.281187 -0.706407
H  -1.797609 4.650301 0.336351
