program: Gaussian 09
title: 000035570
version: EM64L-G09RevD.01
frameworkgroup: C1[X(C12H18Cl3N3O2)]
method: RPBEPBE
basis: SDD
operation: Freq
keyword: #p
keyword: freq=noraman
keyword: PBEPBE/SDD
title: #p freq=noraman PBEPBE/SDD
converged: YES YES NO NO
title: Mulliken charges:
elementType: Cl Cl Cl O O N N N C C C C C C C C C C C C H H H H H H H H H H H H H H H H H H
charge: 0.105657 0.132162 0.105826 -0.193267 -0.190380 0.030205 -0.065482 -0.036630 -0.371111 -0.371056 -0.344022 -0.343994 -0.278073 -0.275822 -0.686754 -0.686579 0.033635 0.017039 0.301521 -0.742912 0.213539 0.213591 0.213853 0.213899 0.197698 0.197556 0.197549 0.197411 0.230936 0.230841 0.230293 0.230175 0.213317 0.213314 0.219563 0.213447 0.213442 0.219614
chargesum: 0.00000
title: Mulliken charges with hydrogens summed into heavy atoms:
elementType: Cl Cl Cl O O N N N C C C C C C C C C C C C
charge: 0.105657 0.132162 0.105826 -0.193267 -0.190380 0.030205 -0.065482 -0.036630 0.056018 0.056696 0.051232 0.050966 0.183704 0.184645 -0.040560 -0.040077 0.033635 0.017039 0.301521 -0.742912
polarizability: 2.73151219e+02 -1.15623682e-01 1.82337200e+02 4.37585930e-02 9.21186547e-03 1.37244945e+02
1716.lowfreq: -13.0836 -2.3735 -0.0023 -0.0017 0.0019 2.1455 6.5981 13.7642 19.5974
frequency: 5.4807 9.6396 19.4829 30.5959 38.6767 50.6753 51.7454 83.9477 104.5885 106.0306 116.4686 120.0603 153.4616 158.5453 172.2855 185.1217 202.7252 219.8628 232.2164 238.3502 239.3904 242.4070 245.0409 295.3248 310.5682 333.2478 368.9761 390.3897 429.5797 470.6490 560.3499 617.2130 620.0631 645.7250 705.7045 737.6009 740.2035 740.6299 749.5889 755.8580 797.3646 797.5616 813.2174 862.2664 890.3688 902.4588 908.3049 920.3929 930.5339 930.6236 1021.5591 1035.4541 1042.9188 1046.2536 1082.3546 1083.1861 1123.8813 1126.0263 1145.2396 1145.7837 1212.5247 1212.7986 1225.0668 1270.6686 1270.8338 1273.4358 1273.7586 1286.9711 1287.0433 1295.6310 1302.5797 1338.4475 1348.3507 1358.7362 1383.1310 1394.1439 1395.4313 1418.2423 1442.1630 1463.1244 1466.6503 1470.1628 1471.3996 1477.7057 1479.5176 1479.6654 1479.8496 1488.4353 1489.5855 1503.8654 2969.0519 2969.0768 2977.7061 2977.9828 2996.4020 2996.7696 3011.6149 3012.1543 3013.2407 3013.2487 3052.0411 3052.3912 3073.8968 3074.2327 3078.1405 3078.2992 3088.3899 3088.8263
redmass: 20.9419 2.2101 2.8073 1.8072 4.1942 6.3288 2.6263 7.0567 3.3502 2.3817 1.9987 5.6433 3.2174 4.4831 7.8649 9.6719 4.3610 20.9995 2.0736 1.1288 8.6048 1.8749 10.5482 22.2958 4.6220 7.1169 8.0842 4.5772 3.7035 4.4775 9.4921 10.5654 13.1762 8.5577 11.8359 11.5497 1.0757 1.0752 11.0454 11.7340 1.1393 1.1433 12.2154 7.5877 11.3442 2.0462 1.8650 6.3616 1.1647 1.1649 9.6720 4.3365 3.5006 6.4670 2.2120 2.2362 2.6174 2.6639 1.4716 1.4753 1.3442 1.3438 12.0818 1.3430 1.3536 1.1588 1.1578 1.0784 1.0787 6.9130 3.2126 1.5031 1.5789 1.7466 1.8114 1.2210 1.2413 8.3495 3.8560 1.1489 1.1199 1.0822 1.0963 1.1049 1.0416 1.0421 1.0855 1.1246 1.0969 4.4690 1.0588 1.0588 1.0364 1.0364 1.0599 1.0600 1.0567 1.0568 1.1007 1.1007 1.1035 1.1035 1.1016 1.1016 1.0994 1.0994 1.1082 1.1082
irintensity: 0.0694 0.0200 0.1522 1.4999 0.6167 0.2599 0.0223 0.2025 3.1703 0.4461 2.2052 0.3540 0.0127 1.9563 1.6789 0.0183 0.0094 0.1338 1.6967 0.0012 0.3488 2.3051 2.0814 1.9742 4.5141 0.7806 0.7545 1.0603 8.8322 2.6296 11.9746 9.0054 64.6137 71.9628 0.2933 67.2376 14.3301 12.8367 103.2549 83.5268 0.1999 1.3837 0.0441 124.6936 13.4967 0.8067 0.3795 1.3932 0.4012 0.7063 4.1278 7.2521 12.6409 194.4713 0.1314 13.2016 15.8215 1.0885 3.9482 0.3867 0.1010 0.0212 346.6279 41.5157 24.5045 0.0268 0.0774 0.1150 0.2114 20.9178 761.7063 42.7127 39.9370 49.4376 3.2931 2.2426 7.9992 388.7358 53.5031 72.3226 5.1690 6.5346 4.4439 81.9304 12.8507 13.4036 0.2340 17.2103 26.9502 668.9692 7.9072 48.9745 37.2996 32.2981 16.8367 22.2249 26.2958 24.8308 3.5642 13.6846 3.8703 3.4711 40.4008 40.3860 48.0259 45.5426 65.9638 70.4855
temp: 298.150 k
press: 1.00000 atm
elementType: 17 17 17 8 8 7 7 7 6 6 6 6 6 6 6 6 6 6 6 6 1 1 1 1 1 1 1 1 1 1 1 1 1 1 1 1 1 1
symmnumber: 1
zpe: 764937.8 jmol-1
zpe.correction: 0.291349 hartree
zpe.thermalcorrener: 0.314750 hartree
zpe.thermalcorrenthalpy: 0.315694 hartree
zpe.thermalcorrgfe: 0.231297 hartree
zpe.sumelectzpe: -2161.373801 hartree
zpe.sumelectthermal: -2161.350400 hartree
zpe.sumelectthermalent: -2161.349456 hartree
zpe.sumelectthermalfe: -2161.433854 hartree
dipole: 0.1912 -0.2631 -0.0030
dipole: 0.3253
quadrupole: -109.9380 -156.3379 -137.5023
quadrupole: 0.6710 0.0050 0.0079
quadrupole: 24.6547 -21.7452 -2.9095 0.6710 0.0050 0.0079
hfenergy: -2161.6651504 hartree
pointgroup: C01 [X(C12H18Cl3N3O2)]
dipole: -0.0745508 0.1039986 -0.0011183 debye
polarizability: 273.1458758|-0.700426|182.3424572|-0.1177832|-0.0022935|137.2450309 unknown
InChI: InChI=1S/C12H18Cl3N3O2/c1-3-5-7-19-10-16-9(12(13,14)15)17-11(18-10)20-8-6-4-2/h3-8H2,1-2H3
charge 0 multiplicity 1
38 atoms
Cl 0.931892 -3.508364 1.516512
Cl -1.666278 -3.668951 -0.004897
Cl 0.935831 -3.505082 -1.518863
O  2.294535 1.311009 -0.002724
O  -2.307891 1.320023 0.003875
N  -0.006372 1.346141 0.001494
N  -1.218858 -0.770204 0.001543
N  1.196079 -0.773096 -0.001184
C  4.704706 1.578491 -0.003707
C  -4.717821 1.590784 0.001111
C  6.097741 0.903744 -0.004625
C  -6.111637 0.917613 -0.000386
C  3.584811 0.54122 -0.005452
C  -3.599575 0.551834 0.004294
C  7.246954 1.933858 -0.006245
C  -7.259755 1.948931 -0.00032
C  1.135098 0.600462 0.000547
C  -1.14823 0.609699 0.001873
C  -0.015188 -1.385295 0.000129
C  0.018408 -2.920557 -0.001844
H  4.601657 2.230171 -0.892037
H  4.601404 2.227243 0.886721
H  -4.615337 2.242018 0.889805
H  -4.612277 2.239646 -0.888947
H  6.191762 0.246418 0.883533
H  6.190231 0.245487 -0.892277
H  -6.204996 0.260696 -0.888939
H  -6.206307 0.259245 0.886977
H  3.604059 -0.107644 0.888753
H  3.602737 -0.1029 -0.903149
H  -3.618565 -0.096867 -0.889992
H  -3.620023 -0.092666 0.901621
H  7.196995 2.58324 -0.900143
H  7.196819 2.586274 0.88545
H  8.232771 1.434743 -0.005269
H  -7.210594 2.59798 0.893846
H  -7.207514 2.601532 -0.891741
H  -8.246072 1.450825 -0.003042
