program: Gaussian 09
title: 000035518
version: EM64L-G09RevD.01
frameworkgroup: C1[X(C5H11N3O)]
method: RPBEPBE
basis: SDD
operation: Freq
keyword: #p
keyword: freq=noraman
keyword: PBEPBE/SDD
title: #p freq=noraman PBEPBE/SDD
converged: NO NO NO NO
title: Mulliken charges:
elementType: O N N N C C C C C H H H H H H H H H H H
charge: -0.310748 -0.255072 -0.386123 -0.386160 -0.093603 -0.093597 -0.706009 -0.705999 0.198462 0.236940 0.236933 0.262112 0.319802 0.319801 0.222748 0.216667 0.242212 0.216675 0.222750 0.242208
chargesum: 0.00000
title: Mulliken charges with hydrogens summed into heavy atoms:
elementType: O N N N C C C C C
charge: -0.310748 0.007040 -0.066321 -0.066358 0.143337 0.143336 -0.024381 -0.024366 0.198462
polarizability: 8.81605690e+01 8.96267623e-04 8.59989570e+01 -2.49907159e-03 -2.30858693e+00 5.61268517e+01
1716.lowfreq: -11.5549 -4.3676 -0.0004 0.0007 0.0009 8.3147 80.8921 125.2797 156.3297
frequency: 80.8830 125.2634 156.3286 229.3481 236.2148 262.4507 298.2841 424.0993 449.4777 454.4510 476.5526 481.0413 529.6085 562.6384 642.0873 704.0951 751.8866 858.8809 880.4251 912.0484 952.4357 1006.0934 1067.4929 1091.0644 1115.9089 1135.8200 1147.3934 1209.0361 1262.7496 1311.7004 1323.3962 1338.2023 1378.5272 1391.1261 1392.2782 1410.0394 1415.2999 1455.2710 1471.2558 1471.4891 1473.3996 1481.8546 1645.4312 2950.9879 2959.5886 2990.2714 2990.6134 3085.9897 3086.3676 3106.6207 3106.9650 3407.0675 3566.8202 3568.4506
redmass: 3.3440 5.7976 2.3422 1.0299 1.1826 2.4506 3.4301 2.5074 1.4879 4.0744 3.2542 2.8137 1.1892 3.2523 1.8654 8.8315 2.9046 2.3287 2.3490 1.7842 1.8960 2.3845 1.9954 2.3256 2.1075 3.1573 2.3992 2.8948 1.2719 1.2808 1.2795 1.2876 1.3643 1.2500 1.2364 1.7754 2.8783 1.2504 1.0565 1.0504 1.0560 1.1533 4.9976 1.0844 1.0851 1.0362 1.0362 1.0999 1.0998 1.0998 1.0997 1.0737 1.0763 1.0789
irintensity: 0.0659 2.4084 0.6603 0.1463 0.3470 0.7077 2.6196 1.6124 9.2686 38.6747 5.6653 52.3716 149.9762 4.6795 47.1080 71.3985 98.7241 2.6833 2.0889 10.9208 1.1894 3.7649 12.2992 0.1480 91.1878 0.0528 15.2766 29.3542 103.3988 10.8178 31.8079 21.4951 44.7779 5.0506 20.4302 0.5788 214.7297 98.3757 0.4589 21.5267 7.6482 36.6865 477.6774 4.6913 95.0416 28.4107 10.6315 19.5897 47.2013 0.5773 43.9711 0.7431 40.6725 4.2195
temp: 298.150 k
press: 1.00000 atm
elementType: 8 7 7 7 6 6 6 6 6 1 1 1 1 1 1 1 1 1 1 1
symmnumber: 1
zpe: 444311.4 jmol-1
zpe.correction: 0.169229 hartree
zpe.thermalcorrener: 0.178587 hartree
zpe.thermalcorrenthalpy: 0.179531 hartree
zpe.thermalcorrgfe: 0.135310 hartree
zpe.sumelectzpe: -435.909342 hartree
zpe.sumelectthermal: -435.899984 hartree
zpe.sumelectthermalent: -435.899040 hartree
zpe.sumelectthermalfe: -435.943261 hartree
dipole: 0.0004 -4.1371 0.3001
dipole: 4.1479
quadrupole: -43.2187 -71.7029 -53.5246
quadrupole: 0.0025 -0.0012 2.3862
quadrupole: 12.9300 -15.5542 2.6242 0.0025 -0.0012 2.3862
hfenergy: -436.0785712 hartree
pointgroup: C01 [X(C5H11N3O1)]
dipole: -0.0022575 1.6283771 0.1075339 debye
dipolederiv: -0.6287895 0.0010988 0.0001107 0.0010288 -1.4113015 -0.0883305 0.0002041 -0.1620651 -0.4204569 -0.6731392 0.0001396 -0.0000885 0.000141 -0.7840717 0.051127 0.0000821 -0.0050002 -0.1597952 -0.9569077 0.4537196 0.0557027 0.3501412 -0.8778355 -0.0210867 -0.0024725 0.0375543 -0.534071 -0.9546498 -0.4539969 -0.0556583 -0.3503867 -0.8800098 -0.0213598 0.0021272 0.0374257 -0.5341417 0.5336598 0.0915049 -0.0657826 -0.0714943 0.8938765 0.079345 -0.1699924 0.0742469 0.4733616 0.5337056 -0.0924241 0.0655235 0.070606 0.8938479 0.0794504 0.1697862 0.074623 0.4733496 -0.0950017 0.0722886 -0.039467 0.0633041 -0.0304889 0.0142653 -0.0610616 0.0034934 0.0615495 -0.0946214 -0.0724468 0.0394854 -0.0634693 -0.03087 0.0143958 0.0610847 0.0037076 0.0615153 1.7285428 -0.0000342 -0.0000493 -0.0000214 1.7744139 0.1633913 0.0000078 0.1824985 0.2884524 0.0239403 -0.0158023 -0.0455233 0.0342786 -0.0676195 -0.0214285 0.0401372 -0.0802122 -0.1843568 0.0239703 0.0160219 0.0455198 -0.0340364 -0.0677035 -0.0213567 -0.0399695 -0.0803409 -0.184357 0.1112499 -0.000289 0.0001535 -0.0003065 0.3220597 -0.1144589 -0.0000206 0.0146677 -0.0220804 0.1432776 -0.0120317 0.0100515 -0.0381283 0.1153284 -0.0251562 0.0327537 -0.0417737 0.3338315 0.1431336 0.0121161 -0.0100298 0.0382088 0.1154273 -0.0251575 -0.0326584 -0.041854 0.3338344 0.0779091 0.0046029 0.0436552 0.0062675 0.0971413 -0.0429061 -0.0247561 -0.0087219 -0.141257 -0.0886098 -0.0600291 0.049877 -0.121817 0.0478426 0.0528166 0.0709225 0.0517619 0.0585497 0.09168 0.0020301 -0.0094525 0.0569354 -0.1276523 -0.0416104 -0.00281 -0.0514631 0.0893723 -0.0891188 0.0596385 -0.0500219 0.1214108 0.0483928 0.052669 -0.0710932 0.0515617 0.0585265 0.0779374 -0.0046699 -0.043563 -0.0063185 0.0970929 -0.0430987 0.0247516 -0.0087353 -0.1412316 0.0918313 -0.0014371 0.0095569 -0.0563439 -0.1278704 -0.0415105 0.002977 -0.0513742 0.0894048 unknown
polarizability: 88.160563|0.0037393|86.0276|-0.0012267|2.1150195|56.0982146 unknown
InChI: InChI=1S/C5H11N3O/c1-3-6-4(2)8-5(9)7-3/h3-4,6-8H,1-2H3
charge 0 multiplicity 1
20 atoms
O  0.003743 -2.733584 -0.191325
N  -0.001893 1.388159 -0.140491
N  -1.177392 -0.730892 0.078119
N  1.179299 -0.727684 0.078553
C  -1.221567 0.73399 0.366506
C  1.219602 0.737413 0.366488
C  -2.483859 1.354729 -0.244948
C  2.480106 1.361379 -0.245369
C  0.001979 -1.476017 -0.004354
H  -1.22974 0.892596 1.465793
H  1.227561 0.896338 1.465727
H  -0.001979 1.434401 -1.171974
H  -2.038858 -1.275872 0.026374
H  2.042214 -1.270405 0.02711
H  -2.485597 1.231318 -1.343364
H  -3.392459 0.872859 0.158067
H  -2.523959 2.430086 -0.004421
H  3.390088 0.882183 0.157704
H  2.482038 1.237565 -1.343742
H  2.517273 2.436937 -0.005252
