program: Gaussian 09
title: 000035529
version: EM64L-G09RevD.01
frameworkgroup: C1[X(C11H13NO4)]
method: RPBEPBE
basis: SDD
operation: Freq
keyword: #p
keyword: freq=noraman
keyword: PBEPBE/SDD
title: #p freq=noraman PBEPBE/SDD
converged: YES YES NO NO
title: Mulliken charges:
elementType: O O O O N C C C C C C C C C C C H H H H H H H H H H H H H
charge: -0.259692 -0.212791 -0.298093 -0.268894 -0.270963 -0.017818 0.301003 0.179355 -0.321141 -0.343400 0.266674 -0.221636 -0.214275 -0.207504 -0.501370 -0.675957 0.244791 0.290375 0.247975 0.226941 0.228579 0.229541 0.232245 0.209674 0.240735 0.241277 0.214881 0.231776 0.227714
chargesum: 0.00000
title: Mulliken charges with hydrogens summed into heavy atoms:
elementType: O O O O N C C C C C C C C C C C
charge: -0.259692 -0.212791 -0.298093 -0.268894 -0.270963 0.226973 0.301003 0.179355 -0.030767 -0.095426 0.266674 0.005306 0.014304 0.254282 0.190315 -0.001586
polarizability: 1.99896019e+02 -7.77125815e+00 1.44120162e+02 -7.86881645e-01 -1.14253813e+01 8.05613592e+01
1716.lowfreq: -5.0732 -2.5873 -0.0003 0.0002 0.0002 6.8709 41.4359 52.1058 68.6394
frequency: 41.2263 52.0307 68.5899 80.0828 93.5377 105.7623 130.0749 147.4855 194.2187 202.1839 253.2066 269.5298 290.7225 300.9441 353.2973 400.0590 420.0272 424.5855 468.0514 552.1913 560.5495 606.5614 628.2130 689.1931 731.1820 742.5503 754.6468 775.4474 802.7086 822.2573 827.2805 859.2824 862.6392 912.6726 934.6191 972.8387 988.8595 1010.3800 1021.1865 1039.1629 1081.3917 1112.3020 1113.9200 1124.7129 1139.2131 1146.1109 1158.0123 1171.3315 1221.2224 1251.7399 1263.2848 1286.7807 1331.5877 1343.3588 1384.1771 1402.6459 1416.1057 1430.8485 1451.2632 1458.0294 1464.1082 1476.1955 1477.8735 1479.0266 1490.2764 1607.9250 1627.7955 1643.1706 2962.8616 2996.3178 3012.6128 3045.0886 3062.7911 3071.5358 3093.3237 3108.2562 3130.8163 3139.8080 3159.6047 3179.3763 3196.0929
redmass: 3.4830 3.2256 2.4707 3.8555 6.9408 3.4318 3.3211 1.2644 3.4917 4.2018 1.1988 5.5360 5.5384 4.0575 4.6029 6.6069 4.0287 4.1806 6.6172 7.2729 4.2230 6.4371 7.2008 10.5800 5.1313 5.6897 1.3289 5.4073 1.0977 5.4380 4.6152 2.0567 2.4505 5.8467 1.3860 1.2909 4.0546 2.1889 5.7714 3.3759 2.4863 1.9974 1.3388 2.3133 1.4626 1.6469 1.4126 1.4904 2.9134 1.1318 1.6411 1.5723 1.2694 1.7864 2.3287 1.3640 3.8689 1.1463 2.5837 1.0524 1.0404 1.2418 1.3063 1.6906 1.1146 7.8372 8.0311 11.8057 1.0351 1.0358 1.0581 1.0882 1.1000 1.1068 1.0985 1.1030 1.1013 1.0864 1.0930 1.0969 1.0962
irintensity: 0.6000 2.1041 3.8691 0.5399 1.5766 2.9554 2.4726 0.1337 0.4316 8.6961 0.4385 0.0429 14.0846 5.0167 5.8935 1.1953 3.9082 9.3118 4.2922 2.5978 0.7742 10.0103 5.5806 10.5350 0.7155 3.8493 107.0198 4.4720 3.0140 66.6880 38.6613 61.6639 86.8154 39.2806 12.6298 0.6338 46.5569 44.7822 235.1467 176.2949 76.4355 1.3286 1.4836 180.3837 5.4988 35.9948 11.2091 10.4660 151.0296 0.3610 131.1229 8.8480 158.6264 137.6514 212.7019 10.4063 23.2598 13.7673 16.3031 12.6364 12.7703 95.7948 92.6734 138.8457 24.7881 66.4119 0.6063 295.3300 62.3853 20.2873 23.5308 30.8171 37.7073 5.9361 30.7709 44.2057 18.4814 3.1888 22.0518 9.4005 1.8321
temp: 298.150 k
press: 1.00000 atm
elementType: 8 8 8 8 7 6 6 6 6 6 6 6 6 6 6 6 1 1 1 1 1 1 1 1 1 1 1 1 1
symmnumber: 1
zpe: 592767.2 jmol-1
zpe.correction: 0.225773 hartree
zpe.thermalcorrener: 0.241186 hartree
zpe.thermalcorrenthalpy: 0.242130 hartree
zpe.thermalcorrgfe: 0.182226 hartree
zpe.sumelectzpe: -781.412356 hartree
zpe.sumelectthermal: -781.396943 hartree
zpe.sumelectthermalent: -781.395999 hartree
zpe.sumelectthermalfe: -781.455903 hartree
dipole: -2.1757 2.1412 -0.8409
dipole: 3.1663
quadrupole: -73.9513 -88.8866 -96.8440
quadrupole: -2.9262 1.5424 0.4779
quadrupole: 12.6094 -2.3260 -10.2834 -2.9262 1.5424 0.4779
hfenergy: -781.6381295 hartree
pointgroup: C01 [X(C11H13N1O4)]
dipole: 0.8500106 -0.8439777 -0.3420364 debye
polarizability: 199.8378012|-7.9092904|144.0541402|-0.1220105|11.8368601|80.6855985 unknown
InChI: InChI=1S/C11H13NO4/c1-3-15-10(13)12-8-6-4-5-7-9(8)16-11(12)14-2/h4-7,11H,3H2,1-2H3
charge 0 multiplicity 1
29 atoms
O  -1.012542 -1.687121 -0.813122
O  0.727902 -1.922785 0.843547
O  2.491751 0.377156 -0.270238
O  1.203803 2.241006 0.373462
N  0.224768 0.164125 -0.115645
C  0.356335 -1.274105 -0.378836
C  -1.157126 0.498652 -0.003865
C  -1.888267 -0.640921 -0.416892
C  -1.807954 1.676735 0.392843
C  -3.28364 -0.662431 -0.451327
C  1.296453 1.035416 0.0360
C  -3.228148 1.669964 0.362138
C  -3.952431 0.526497 -0.049743
C  3.726191 1.200163 -0.09825
C  1.058126 -3.349194 0.66529
C  4.902354 0.303125 -0.467985
H  1.051611 -1.518206 -1.2018
H  -1.235586 2.552699 0.704085
H  -3.829549 -1.552348 -0.775404
H  -3.769956 2.571583 0.666327
H  -5.047109 0.551494 -0.060789
H  3.647706 2.088132 -0.750935
H  3.76913 1.54299 0.951123
H  1.863164 -3.475912 -0.08674
H  0.164474 -3.92223 0.359263
H  1.410301 -3.692875 1.648554
H  5.847499 0.864212 -0.352639
H  4.942552 -0.583409 0.187629
H  4.827288 -0.036814 -1.515153
