program: Gaussian 09
title: 000035514
version: EM64L-G09RevD.01
frameworkgroup: C1[X(C5H7N3O3)]
method: RPBEPBE
basis: SDD
operation: Freq
keyword: #pfreq=noraman
keyword: PBEPBE/SDD
title: #p freq=noraman PBEPBE/SDD
converged: NO YES NO NO
title: Mulliken charges:
elementType: O O O N N N C C C C C H H H H H H H
charge: -0.238487 -0.238508 -0.226551 -0.203839 -0.393704 -0.393625 -0.298991 0.262900 0.262860 -0.662517 0.173607 0.247755 0.247754 0.238448 0.238407 0.227849 0.378317 0.378325
chargesum: 0.00000
title: Mulliken charges with hydrogens summed into heavy atoms:
elementType: O O O N N N C C C C C
charge: -0.238487 -0.238508 -0.226551 -0.203839 -0.015387 -0.015300 0.196518 0.262900 0.262860 0.042186 0.173607
polarizability: 1.08402286e+02 3.31889079e-04 9.18290479e+01 4.46606670e+00 1.38501004e-03 4.69798085e+01
1716.lowfreq: -3.8342 -0.0010 -0.0005 -0.0004 6.4495 13.5248 55.4179 73.9324 156.0000
frequency: 54.7943 73.9266 156.0000 158.7403 185.1767 213.7158 340.3943 354.3701 364.8207 414.7686 482.3514 509.5259 621.7834 634.3561 644.2151 666.8992 718.2917 726.8881 736.5903 762.2736 782.2812 968.6175 994.6015 1009.9238 1093.2199 1153.2928 1156.7498 1202.9179 1326.5377 1348.6433 1369.4992 1372.7036 1388.7906 1394.6630 1397.0861 1454.7337 1473.9244 1480.5858 1639.6076 1682.1325 1693.8694 2996.3092 3049.1149 3094.9244 3096.3219 3123.9489 3558.9749 3560.6565
redmass: 2.7403 5.7105 8.5286 6.1246 5.7577 1.0896 2.3308 7.2611 11.4937 8.5099 4.4698 8.5289 10.8117 4.3878 1.6420 1.6766 5.8521 2.9218 4.1599 3.0037 1.2093 2.5479 3.1001 2.3933 2.1623 5.6439 4.6329 2.5269 1.4021 1.7996 1.7021 1.4845 1.9998 4.4363 1.4950 1.1143 1.0406 1.0517 7.0935 8.2467 5.8527 1.0356 1.0603 1.0980 1.1023 1.1061 1.0768 1.0792
irintensity: 0.1435 0.8380 5.2039 0.0074 4.5356 0.4596 0.9182 31.0629 24.4732 1.1163 15.8598 21.8959 1.5470 1.1562 0.0153 79.1795 4.0760 0.1628 3.4606 227.5789 11.1733 7.0910 7.2587 5.5506 13.5679 1.0795 4.6745 0.6032 25.6551 190.5733 26.4346 78.2411 180.5759 185.0620 47.1506 63.2793 23.4850 11.9993 721.6092 118.3537 682.6275 16.8738 10.7462 32.4274 8.1275 7.2176 134.4369 47.9292
temp: 298.150 k
press: 1.00000 atm
elementType: 8 8 8 7 7 7 6 6 6 6 6 1 1 1 1 1 1 1
symmnumber: 1
zpe: 351011.3 jmol-1
zpe.correction: 0.133693 hartree
zpe.thermalcorrener: 0.143659 hartree
zpe.thermalcorrenthalpy: 0.144604 hartree
zpe.thermalcorrgfe: 0.097796 hartree
zpe.sumelectzpe: -583.904838 hartree
zpe.sumelectthermal: -583.894872 hartree
zpe.sumelectthermalent: -583.893928 hartree
zpe.sumelectthermalfe: -583.940736 hartree
dipole: -1.1657 0.0003 0.0351
dipole: 1.1662
quadrupole: -69.1996 -72.2501 -62.7411
quadrupole: 0.0008 -1.2497 -0.0012
quadrupole: -1.1360 -4.1865 5.3225 0.0008 -1.2497 -0.0012
hfenergy: -584.0385316 hartree
pointgroup: C01 [X(C5H7N3O3)]
dipole: -0.4584002 0.0003228 0.0199589 debye
dipolederiv: -0.6959882 -0.2599131 -0.0343499 -0.2353716 -1.1076635 -0.0546131 -0.0348881 -0.0397532 -0.3613348 -0.6954023 0.259485 -0.0343608 0.2348194 -1.1082818 0.054746 -0.034725 0.0394837 -0.3613279 -1.3787292 0.0004093 -0.1043225 0.0005126 -0.5353291 0.0000634 -0.1292338 0.0000822 -0.3865819 -0.8442995 -0.0004853 0.0324501 -0.0003718 -1.4792756 -0.0000277 -0.0375822 0.0001098 -0.2501981 -1.337772 -0.3591101 -0.093159 -0.4098827 -0.7300124 -0.0500483 -0.1204004 -0.0464266 -0.3746538 -1.3369133 0.3597567 -0.093026 0.4105323 -0.7308882 0.0501691 -0.1204641 0.0465705 -0.3745933 0.6550456 -0.0002097 -0.0510625 -0.0003174 0.1026218 0.0000693 0.004946 0.0000458 0.2293048 1.6100143 0.0553887 0.1256882 -0.0642717 1.7530114 0.043357 0.1414169 0.0079447 0.3433358 1.6099433 -0.0551832 0.1256552 0.064572 1.7530909 -0.0435586 0.1413366 -0.0078732 0.3432768 -0.0593972 0.0000333 0.0318034 0.0000548 0.0637065 0.0000303 0.0365114 0.0000393 -0.0603145 2.0106356 -0.0002698 0.1792415 -0.0003133 1.4532528 -0.0001256 0.2038613 -0.0001379 0.3856149 0.0418484 -0.0060044 0.0239986 0.0669879 0.0207274 0.1106065 0.0194954 0.0570403 0.0268048 0.0416888 0.0059557 0.0238826 -0.0669936 0.0208662 -0.1106856 0.0193998 -0.0570928 0.0266282 0.0967368 0.0686187 -0.0327956 0.0303863 -0.041289 0.1085133 -0.0108474 0.0607874 0.0119664 0.0966007 -0.0687293 -0.0329471 -0.0305269 -0.0410774 -0.1085407 -0.0108979 -0.060861 0.0117768 -0.1774101 0.0001481 -0.0229506 0.0001561 0.1149911 0.0000229 -0.0241461 0.0000316 0.0786977 0.1816288 -0.0538464 -0.0218689 -0.0631916 0.245827 -0.0049154 -0.0218857 -0.0057845 0.3557985 0.1817697 0.0539559 -0.0218768 0.0632192 0.2457217 0.0049372 -0.0218967 0.005794 0.3557994 unknown
polarizability: 108.5110861|-0.0063495|91.8290504|3.6401918|-0.0006786|46.871006 unknown
InChI: InChI=1S/C5H7N3O3/c1-2-8-4(10)6-3(9)7-5(8)11/h6-7H,2H2,1H3
charge 0 multiplicity 1
18 atoms
O  -0.728883 -2.351755 -0.223732
O  -0.726344 2.352152 -0.223458
O  3.284669 -0.002011 0.281889
N  -0.785371 0.000241 -0.248572
N  1.266647 -1.170039 0.025964
N  1.267945 1.168325 0.025959
C  -2.268268 0.000991 -0.418266
C  -0.130829 -1.250129 -0.151783
C  -0.12946 1.24985 -0.151974
C  -3.005703 0.000749 0.933326
C  2.041265 -0.001225 0.1237
H  -2.519561 0.90204 -1.000329
H  -2.520412 -0.899327 -1.001102
H  -2.755673 -0.899617 1.520111
H  -2.754787 0.900332 1.520936
H  -4.09621 0.001366 0.756842
H  1.764163 -2.061138 0.091409
H  1.766212 2.058995 0.091478
