program: Gaussian 09
title: 000035550
version: EM64L-G09RevD.01
frameworkgroup: C1[X(C7H6Cl6N4O)]
method: RPBEPBE
basis: SDD
operation: Freq
keyword: #p
keyword: freq=noraman
keyword: PBEPBE/SDD
title: #p freq=noraman PBEPBE/SDD
converged: NO YES NO NO
title: Mulliken charges:
elementType: Cl Cl Cl Cl Cl Cl O N N N N C C C C C C C H H H H H H
charge: 0.067204 0.162392 0.138758 0.108362 0.132298 0.113474 -0.355817 -0.300002 -0.054038 -0.065113 0.018334 -0.049541 0.078384 -0.635147 0.297900 0.075100 -0.768622 -0.744320 0.335205 0.343831 0.349036 0.251600 0.251274 0.249446
chargesum: 0.00000
title: Mulliken charges with hydrogens summed into heavy atoms:
elementType: Cl Cl Cl Cl Cl Cl O N N N N C C C C C C C
charge: 0.067204 0.162392 0.138758 0.108362 0.132298 0.113474 -0.006781 0.043829 -0.054038 -0.065113 0.018334 0.285664 0.078384 -0.635147 0.297900 0.075100 -0.768622 0.008000
polarizability: 2.11016290e+02 1.47055289e+01 1.74693405e+02 1.56556533e+01 4.18190611e+00 1.30991937e+02
1716.lowfreq: -4.6290 -0.0003 0.0019 0.0021 2.8989 6.1251 13.6730 19.2037 33.8129
frequency: 13.3438 19.0099 33.7913 41.8510 59.6208 81.6651 87.1715 139.5916 140.3332 170.3155 177.6888 183.4229 207.5757 217.4816 225.5288 232.0909 249.4945 266.4248 289.3753 295.6722 318.2685 352.1185 373.7577 380.3371 395.2554 465.2977 514.6325 557.1454 570.1548 594.5429 634.4404 641.3842 686.3755 721.1208 754.0254 758.4092 764.0544 795.0008 827.8866 907.9057 939.9773 973.4968 980.5633 1019.1743 1051.4508 1058.1573 1119.2032 1191.6078 1244.4253 1274.3099 1305.6542 1355.8665 1393.5251 1397.9387 1400.8999 1444.8159 1452.1986 1480.6435 1501.6399 1541.6369 3002.5787 3084.5205 3091.2709 3139.3131 3510.9972 3526.2335
redmass: 26.4951 17.2309 10.6741 11.5863 1.0559 12.0751 8.4169 11.6359 14.6469 10.9721 7.5195 6.7942 6.3576 20.2193 10.6115 12.5649 11.9002 13.6232 15.0221 9.3672 9.1235 1.3626 13.9784 11.2283 4.9862 4.4291 5.5796 6.3186 3.8823 4.6034 5.4430 4.6148 1.7100 10.3171 10.1052 10.2221 9.8612 7.6469 9.5376 13.7024 4.5947 5.1334 2.8914 6.8704 1.6629 3.8726 2.9747 6.5750 1.4465 1.8261 2.8214 3.0411 2.5104 1.4671 1.1248 1.3141 1.0495 4.5602 3.1700 4.8076 1.0381 1.0960 1.0858 1.1005 1.0656 1.0768
irintensity: 0.0776 0.0198 0.1108 0.1100 0.7740 0.3961 0.1016 0.6984 0.7414 3.8304 0.2504 1.4492 1.1151 0.0812 0.5491 0.4944 3.6850 1.5138 1.3211 1.0434 2.7984 112.4076 3.7372 9.4945 22.9590 4.9580 63.7290 16.3117 135.5006 22.4534 76.6022 69.0587 74.0214 100.9840 37.0593 108.5983 205.5834 95.2124 1.5203 17.8469 56.9867 59.1838 62.6810 57.4877 9.3989 18.7525 68.3349 44.6644 98.1507 2.8767 50.5085 32.8951 82.8200 101.8025 9.8698 93.7365 20.9887 252.5393 181.1180 920.0358 0.9363 5.1997 39.6859 9.1794 21.1289 76.0201
temp: 298.150 k
press: 1.00000 atm
elementType: 17 17 17 17 17 17 8 7 7 7 7 6 6 6 6 6 6 6 1 1 1 1 1 1
symmnumber: 1
zpe: 356640.7 jmol-1
zpe.correction: 0.135837 hartree
zpe.thermalcorrener: 0.155654 hartree
zpe.thermalcorrenthalpy: 0.156599 hartree
zpe.thermalcorrgfe: 0.083091 hartree
zpe.sumelectzpe: -3323.560631 hartree
zpe.sumelectthermal: -3323.540814 hartree
zpe.sumelectthermalent: -3323.539869 hartree
zpe.sumelectthermalfe: -3323.613376 hartree
dipole: -2.2393 3.4722 -0.3090
dipole: 4.1432
quadrupole: -151.0387 -138.9382 -145.4553
quadrupole: 2.6056 3.7384 -3.1914
quadrupole: -5.8946 6.2059 -0.3113 2.6056 3.7384 -3.1914
hfenergy: -3323.6964679 hartree
pointgroup: C01 [X(C7H6Cl6N4O1)]
dipole: -0.7663546 1.4159749 -0.2546523 debye
dipolederiv: -0.4703444 0.2302831 -0.092906 0.2917518 -0.533045 0.1788512 -0.0831612 0.1847449 -0.2791473 -0.3960464 -0.2980716 -0.031068 -0.358892 -0.5845689 -0.0445586 0.0135923 -0.0221337 -0.0981061 -0.2380769 -0.0427824 -0.1608564 -0.0647403 -0.1416346 -0.1129884 -0.1415099 -0.0892883 -0.7048317 -0.2891334 0.0432467 -0.2601888 0.0497804 -0.1887699 -0.0116193 -0.2390539 -0.0287065 -0.6548428 -0.3099124 -0.2591724 -0.0176444 -0.270789 -0.4956275 -0.0302566 -0.0154319 -0.0216095 -0.1276772 -0.4700575 0.0611995 0.3262984 0.0701792 -0.1784566 -0.0092075 0.2968011 0.0120766 -0.4706752 -0.7131339 -0.2402879 0.0431953 -0.439395 -0.2638613 -0.0264234 -0.2115655 -0.1373051 -0.8498795 -2.0521936 -0.3777003 -0.1055679 -0.4754472 -0.3545238 -0.1197127 -0.0164872 -0.0040117 -0.5181414 -1.3893182 0.0124475 -0.1206613 0.6288799 -0.5087141 0.0801443 -0.1827851 0.0219108 -0.1687945 -1.3529222 -0.167054 -0.1094263 -0.6117472 -0.6880287 -0.0299865 -0.1236215 0.0064815 -0.2166674 -0.6246944 0.0300591 -0.0503963 0.0421033 -1.3838022 0.0773088 -0.0714017 0.0660256 -0.1343274 0.8879249 0.3541563 -0.0316509 1.0459435 0.3041173 0.153646 0.0254331 0.1454942 0.7406999 2.5321132 0.2326989 0.2034255 -0.0249148 0.423814 -0.0153436 0.3051648 0.0207502 0.2701384 1.0154552 0.0357417 0.3995216 0.0694207 1.3365802 -0.0732495 0.2422911 -0.0672381 1.0010508 0.9294147 -0.109915 0.11625 -0.2848756 0.8717704 -0.0839405 0.1581399 -0.0702031 -0.0212273 1.0754951 0.173373 0.1036883 0.24044 1.2309885 -0.0347051 0.1045019 -0.0463727 0.1140605 1.0361103 0.3144406 -0.0639939 0.2230667 0.8802528 0.0645732 -0.0628857 0.0728849 1.2814807 -0.1820555 -0.3316052 0.0008189 -0.1885129 -0.2532447 -0.0053244 0.0088819 0.0012497 -0.0211263 0.2194347 0.0456453 -0.0329582 -0.0552453 0.0864632 0.0331473 0.0594127 -0.0196829 0.0399314 0.2625508 0.0130568 -0.0475646 -0.0847488 0.1773434 -0.017729 -0.0522384 -0.0089243 0.3026479 0.3377573 0.1230028 -0.070865 0.1653747 0.1364049 0.0230772 -0.0090088 -0.0137585 0.3947546 0.0970325 0.013173 -0.0806701 -0.0074405 0.0696848 0.0230928 -0.0913126 -0.0232512 -0.0138718 0.0670538 0.0103742 0.0933018 -0.0044118 0.0690118 -0.0230657 0.0990056 0.0138048 0.0132532 0.0275463 0.13369 -0.0100816 0.0442203 -0.012154 0.00427 -0.012761 0.0070625 0.1212983 unknown
polarizability: 213.4332968|12.9792289|172.6677088|14.0960787|-1.3182784|130.6006267 unknown
InChI: InChI=1S/C7H6Cl6N4O/c1-2-14-3(6(8,9)10)16-5(15-2)17-4(18)7(11,12)13/h4,17-18H,1H3
charge 0 multiplicity 1
24 atoms
Cl -4.588686 1.055587 -0.186966
Cl -4.409821 -1.93824 0.296121
Cl -2.972613 -0.046921 2.154197
Cl 3.567856 -1.427662 1.948851
Cl 1.718409 -3.024002 0.180502
Cl 4.049445 -1.559792 -1.044421
O  -2.5886 -0.724368 -1.890221
N  -1.453574 0.826543 -0.403677
N  0.574227 -0.337552 -0.078432
N  0.501077 2.097112 -0.21027
N  2.608354 0.955012 0.129629
C  -2.211942 -0.405748 -0.527274
C  -0.090093 0.856581 -0.229833
C  -3.466943 -0.363494 0.39774
C  1.909736 -0.211875 0.094377
C  1.853433 2.095827 -0.02599
C  2.738957 -1.491266 0.277934
C  2.574935 3.411235 0.004309
H  -1.562523 -1.239368 -0.213884
H  -1.921304 1.733614 -0.490178
H  -3.223718 -0.041063 -2.235495
H  3.167388 3.496245 0.932008
H  3.292447 3.466587 -0.834292
H  1.861353 4.244409 -0.065535
