program: Gaussian 09
title: 000035551
version: EM64L-G09RevD.01
frameworkgroup: C1[X(C8H9Cl6N5O2)]
method: RPBEPBE
basis: SDD
operation: Freq
keyword: #p
keyword: freq=noraman
keyword: PBEPBE/SDD
title: #p freq=noraman PBEPBE/SDD
converged: YES YES NO NO
title: Mulliken charges:
elementType: Cl Cl Cl Cl Cl Cl O O N N N N N C C C C C C C C H H H H H H H H H
charge: 0.065367 0.153874 0.134126 0.065325 0.153884 0.134356 -0.358521 -0.358591 -0.312422 -0.312512 -0.133685 -0.099006 -0.096534 -0.029864 -0.030241 0.119393 0.118189 -0.644552 -0.644354 0.072557 -0.746515 0.318937 0.319110 0.341220 0.341418 0.244449 0.246221 0.244638 0.346857 0.346877
chargesum: 0.00000
title: Mulliken charges with hydrogens summed into heavy atoms:
elementType: Cl Cl Cl Cl Cl Cl O O N N N N N C C C C C C C C
charge: 0.065367 0.153874 0.134126 0.065325 0.153884 0.134356 -0.011664 -0.011715 0.028798 0.028906 -0.133685 -0.099006 -0.096534 0.289072 0.288869 0.119393 0.118189 -0.644552 -0.644354 0.072557 -0.011206
polarizability: 2.24023843e+02 -4.10617556e-01 2.24572110e+02 2.28997063e+01 7.30059399e-01 1.50313405e+02
1716.lowfreq: -31.5253 -7.0653 -3.3356 0.0012 0.0017 0.0018 4.4074 17.9321 20.6730
frequency: -31.5244 17.9112 20.5803 27.1405 34.3931 40.0998 57.7037 76.6491 131.4738 140.7642 154.4578 170.5972 174.4048 187.5947 188.7149 190.0944 211.9978 220.3780 248.9680 249.0772 260.4944 262.4539 298.2082 308.5159 338.8664 347.8047 365.0303 375.5241 380.0220 419.1254 472.2682 505.0838 517.5346 548.3587 574.1763 578.7132 597.4420 640.7618 642.5794 658.6168 661.5849 722.9811 757.8519 758.4436 768.6409 806.2732 808.0308 906.5149 925.5722 938.8539 969.2079 987.9859 1024.2063 1024.9147 1051.9762 1073.9472 1132.7532 1142.0010 1207.2369 1245.8983 1249.1131 1259.0210 1283.6957 1338.3651 1346.6198 1393.3732 1396.5861 1397.2474 1420.6338 1453.7971 1455.8214 1489.8801 1499.4460 1518.5856 1558.6608 2997.6990 3088.8836 3099.1147 3100.2862 3135.5381 3515.7725 3515.9187 3532.9881 3533.8468
redmass: 1.0123 20.0535 16.0975 20.2121 12.6202 8.5495 8.5349 10.0102 7.6033 12.7456 8.6305 12.5439 11.6292 18.4329 10.7713 5.6258 4.8195 8.0415 10.8867 10.8540 10.4293 17.4692 9.3074 9.2776 1.3956 1.3202 4.0080 10.1121 7.5689 6.4804 4.3080 5.1605 5.6622 5.3794 3.5981 4.2473 2.5620 1.4938 3.8268 2.6435 2.8864 8.2317 9.8692 9.6790 8.7505 8.9620 6.9386 13.3261 4.9207 4.6476 6.7265 2.3999 4.3763 5.8848 1.6559 5.3223 2.9606 3.0369 4.4341 1.4002 1.4648 1.4495 1.4707 2.3313 2.2745 1.2711 1.1668 1.1124 2.3525 1.1568 1.0994 2.8885 4.2742 4.1493 5.1159 1.0408 1.0914 1.0853 1.0850 1.1020 1.0656 1.0656 1.0768 1.0769
irintensity: 0.1561 0.0103 0.0395 0.0028 0.0051 0.2022 0.0505 0.2248 0.2180 1.2024 6.3820 0.9461 1.1719 0.1631 1.3199 0.6574 2.8367 0.3087 3.6007 2.4083 2.6879 1.0359 3.6237 5.9961 97.4097 122.4758 20.8668 11.8042 8.8103 26.4791 3.5778 3.8804 181.9389 10.3841 49.4207 61.7438 37.9972 58.5765 76.3577 162.1948 144.1888 13.7255 156.7764 77.5772 32.6503 56.9367 140.1068 14.0433 33.5604 184.7234 39.0207 115.5280 44.3546 11.4173 14.8720 38.5153 75.7606 51.6319 2.6336 145.5157 44.0821 46.5971 30.1016 7.8573 0.9255 10.3981 37.1732 20.0325 170.7487 19.7279 72.9300 1113.2729 248.9137 563.7830 529.0444 3.9177 11.5629 61.8009 5.0749 7.8976 28.9289 8.0174 134.5464 9.0928
temp: 298.150 k
press: 1.00000 atm
elementType: 17 17 17 17 17 17 8 8 7 7 7 7 7 6 6 6 6 6 6 6 6 1 1 1 1 1 1 1 1 1
symmnumber: 1
zpe: 485267.3 jmol-1
zpe.correction: 0.184829 hartree
zpe.thermalcorrener: 0.207428 hartree
zpe.thermalcorrenthalpy: 0.208372 hartree
zpe.thermalcorrgfe: 0.128899 hartree
zpe.sumelectzpe: -3493.217480 hartree
zpe.sumelectthermal: -3493.194881 hartree
zpe.sumelectthermalent: -3493.193937 hartree
zpe.sumelectthermalfe: -3493.273410 hartree
dipole: -0.0271 2.3828 0.0687
dipole: 2.3840
quadrupole: -161.5992 -162.3127 -160.6433
quadrupole: -0.1248 10.5988 0.4180
quadrupole: -0.0808 -0.7943 0.8751 -0.1248 10.5988 0.4180
hfenergy: -3493.4023087 hartree
pointgroup: C01 [X(C8H9Cl6N5O2)]
dipole: -0.0046773 -0.9375812 -0.0251284 debye
polarizability: 225.3815117|0.3433133|224.5789254|-20.5509981|0.4513803|148.9489207 unknown
InChI: InChI=1S/C8H9Cl6N5O2/c1-2-15-5(17-3(20)7(9,10)11)19-6(16-2)18-4(21)8(12,13)14/h3-4,17-18,20-21H,1H3
charge 0 multiplicity 1
30 atoms
Cl -5.228916 0.638626 0.597868
Cl -3.837069 3.209671 -0.220985
Cl -3.699015 0.804098 -2.035027
Cl 5.226896 0.682596 -0.594707
Cl 3.810914 3.250387 0.192134
Cl 3.69236 0.865361 2.034495
O  -2.390003 1.422873 1.825281
O  2.382305 1.42804 -1.83401
N  -2.320035 -0.553949 0.403853
N  2.329854 -0.534118 -0.391663
N  0.004472 -0.459696 0.005833
N  1.20896 -2.571946 -0.19557
N  -1.177416 -2.58194 0.230568
C  -2.428262 0.886028 0.474037
C  2.42413 0.905972 -0.477027
C  -1.119732 -1.208247 0.207747
C  1.13588 -1.198042 -0.189691
C  -3.708986 1.372874 -0.271569
C  3.699377 1.413201 0.264395
C  0.019059 -3.21367 0.019457
C  0.019992 -4.717374 0.000162
H  -1.544875 1.325813 -0.015136
H  1.535975 1.342412 0.006482
H  -3.138264 -1.149566 0.556857
H  3.153911 -1.123596 -0.537137
H  -0.243655 -5.078514 -1.012043
H  1.020078 -5.103154 0.249445
H  -0.73511 -5.110352 0.698976
H  -3.159221 1.067988 2.346229
H  3.155498 1.074921 -2.350256
