program: Gaussian 09
title: 000035562
version: EM64L-G09RevD.01
frameworkgroup: C1[X(C9H12Cl3N5O)]
method: RPBEPBE
basis: SDD
operation: Freq
keyword: #p
keyword: freq=noraman
keyword: PBEPBE/SDD
title: #p freq=noraman PBEPBE/SDD
converged: YES YES NO NO
title: Mulliken charges:
elementType: Cl Cl Cl O N N N N N C C C C C C C C C H H H H H H H H H H H H
charge: 0.109354 0.145366 0.091344 -0.209797 -0.390312 -0.441770 0.020340 -0.077260 0.010876 -0.015268 -0.663619 -0.703494 0.251007 0.037068 0.293352 0.084947 -0.769794 -0.745550 0.245515 0.300515 0.213541 0.197735 0.264511 0.232127 0.229299 0.202697 0.339941 0.246143 0.245268 0.255920
chargesum: 0.00000
title: Mulliken charges with hydrogens summed into heavy atoms:
elementType: Cl Cl Cl O N N N N N C C C C C C C C C
charge: 0.109354 0.145366 0.091344 -0.209797 -0.089796 -0.101829 0.020340 -0.077260 0.010876 0.230247 0.012168 -0.039372 0.251007 0.037068 0.293352 0.084947 -0.769794 0.001781
polarizability: 2.29928788e+02 -1.63798742e+01 1.70535185e+02 2.35863604e+00 5.55115640e+00 1.20817300e+02
1716.lowfreq: -35.8462 -3.4854 -0.0018 -0.0011 0.0015 2.8976 3.8806 13.9115 24.8675
frequency: -35.8309 13.5838 24.5291 42.4987 48.9848 70.5065 87.2213 99.4213 140.9859 151.1658 179.2774 204.2529 213.8628 215.6588 222.8065 228.1102 236.3843 257.3396 291.7153 307.5397 319.7522 368.4841 380.5998 404.7289 456.7525 487.2980 522.3912 554.4929 584.7534 600.2160 625.4264 655.1473 679.4454 721.1280 750.4915 761.9323 794.5603 830.0486 845.5456 905.0992 914.6835 922.5590 946.2146 954.8714 984.0050 1010.6369 1051.3983 1083.7252 1144.3131 1144.7143 1173.0669 1184.6951 1213.9544 1280.8174 1308.5761 1331.2149 1346.4383 1378.6623 1382.1774 1396.0945 1397.1153 1446.2519 1447.9400 1458.5330 1464.2061 1469.7302 1481.2495 1482.7612 1488.4559 1497.6682 1515.6728 1671.2219 2976.9771 2982.9782 2997.4065 3026.6852 3070.9618 3082.4357 3088.9316 3095.2770 3100.0138 3137.9103 3520.9598 3532.0568
redmass: 1.0176 17.9978 5.3541 3.7774 3.8973 5.5783 8.6896 5.6032 9.1919 5.2093 5.3289 5.4981 9.3173 1.0276 5.9448 5.9758 6.0573 1.3065 17.1766 3.6786 9.5139 3.0801 11.7064 2.8712 3.5056 3.3495 1.2857 5.8294 2.1232 2.3323 7.7968 4.0096 6.8778 7.6692 9.4169 10.8983 6.2608 9.5274 2.5510 13.3191 2.6746 1.3251 1.8882 2.2240 2.5625 3.7956 1.6683 2.7984 2.1925 2.0870 2.7745 2.9214 2.9696 4.1637 1.5610 3.9806 1.3081 1.2135 2.8479 1.2536 1.3701 1.4297 1.2306 1.2156 1.1085 1.0499 2.3682 1.4594 1.0560 2.7464 5.9832 8.2433 1.0379 1.0364 1.0414 1.0851 1.0980 1.0988 1.0908 1.0997 1.1003 1.1020 1.0761 1.0773
irintensity: 0.2941 0.0417 1.6030 0.1835 0.4339 5.5330 0.1079 0.8849 0.2674 2.0695 0.3154 0.7850 1.1904 0.0329 3.5973 5.6825 1.5778 1.4383 0.1267 0.9866 6.0109 2.7056 0.5564 8.6260 7.7919 4.1295 139.5224 8.5738 7.1782 150.8025 29.0682 26.3861 28.7004 34.4548 98.2147 122.9235 16.2057 0.9977 5.3806 22.0549 14.7074 4.2115 14.1935 16.5403 4.5534 37.9015 13.9839 11.7023 40.5249 16.1563 9.7497 122.0431 290.6777 1.1431 24.2243 106.4924 41.6287 20.2221 71.6841 97.9260 55.0099 525.9956 33.0722 147.4813 79.0004 3.4722 215.2913 105.0057 27.8629 103.0706 559.3321 290.7247 23.6963 26.3486 2.1874 1.3306 13.6944 59.7721 9.6231 25.5799 27.7648 5.2806 37.3031 37.9417
temp: 298.150 k
press: 1.00000 atm
elementType: 17 17 17 8 7 7 7 7 7 6 6 6 6 6 6 6 6 6 1 1 1 1 1 1 1 1 1 1 1 1
symmnumber: 1
zpe: 561469.4 jmol-1
zpe.correction: 0.213852 hartree
zpe.thermalcorrener: 0.232944 hartree
zpe.thermalcorrenthalpy: 0.233888 hartree
zpe.thermalcorrgfe: 0.163223 hartree
zpe.sumelectzpe: -2077.969035 hartree
zpe.sumelectthermal: -2077.949944 hartree
zpe.sumelectthermalent: -2077.948999 hartree
zpe.sumelectthermalfe: -2078.019665 hartree
dipole: 5.6003 4.1422 2.4580
dipole: 7.3867
quadrupole: -107.6120 -119.6221 -127.7571
quadrupole: -1.6588 6.7688 0.4448
quadrupole: 10.7184 -1.2917 -9.4267 -1.6588 6.7688 0.4448
hfenergy: -2078.1828879 hartree
pointgroup: C01 [X(C9H12Cl3N5O1)]
dipole: -2.0428633 2.0313995 -0.3818158 debye
polarizability: 232.7766743|9.2154178|167.8344478|-3.9294738|4.4876373|120.6701513 unknown
InChI: InChI=1S/C9H12Cl3N5O/c1-4(2)13-8(18)17-7-15-5(3)14-6(16-7)9(10,11)12/h4,13,17H,1-3H3
charge 0 multiplicity 1
30 atoms
Cl 3.922157 -1.978493 0.573157
Cl 1.396325 -2.940812 -0.756159
Cl 3.412761 -1.361503 -2.355193
O  -1.969522 -0.877897 1.173565
N  -3.460727 0.541758 0.061547
N  -1.241354 1.231535 0.320507
N  0.612225 -0.17718 -0.169836
N  0.881381 2.192908 0.336101
N  2.819338 0.828826 -0.143167
C  -4.648891 -0.32489 0.265188
C  -4.66836 -1.489307 -0.752767
C  -5.922933 0.539041 0.197132
C  -2.217521 0.182259 0.549242
C  0.119895 1.059765 0.168809
C  1.957398 -0.217838 -0.296436
C  2.226811 2.030319 0.159357
C  2.605194 -1.557959 -0.675447
C  3.109682 3.238197 0.289672
H  -4.540463 -0.753166 1.278623
H  -3.530814 1.29958 -0.621749
H  -5.518067 -2.164874 -0.545592
H  -4.773192 -1.110187 -1.786655
H  -3.735736 -2.073715 -0.68091
H  -5.903432 1.344666 0.952338
H  -6.81356 -0.086159 0.38152
H  -6.041616 0.996767 -0.804579
H  -1.523884 2.204996 0.469526
H  3.151701 3.776958 -0.676221
H  2.704896 3.933951 1.041344
H  4.134107 2.933553 0.551185
